{"text_format":"1","workbook":"xlsx","n_sheets":22,"sheets":["Internal","PERCENTAGE","PERCENTAGE2","eSUBWAR","Main","eSUBMAR","eSPAR","eMARKS","pSPAR","pRCPT1","pRCPT2","pRCPT3","pPT1","pPT2","pPT3","pPT1-H","pPT2-H","pPT3-H","pRCPT1-H","pRCPT2-H","pRCPT3-H","Buy"],"not_rendered":{"charts":0,"images":7,"macros":1,"external_links":0,"defined_names":9,"comments":8,"pivot_tables":0},"unopened":[],"bounds":{"document_bytes":16777216,"sheet_cells":100000,"rows_first":2000,"rows_last":500,"rows_between":2000,"halvings":0,"cell_chars":16384,"cell_head_chars":4096},"cells_cut":0,"cells_raw":0,"read":"whole","date_system":"1900"}

{"sheet":"Internal","index":0,"n_rows":34,"n_cols":3,"rows_kept":34,"cut":false,"hidden":false,"merged":[[33,1,33,6],[1,1,1,6],[28,1,28,6],[29,1,29,6],[30,1,30,6],[2,1,2,2],[2,4,2,5],[24,2,24,6],[25,2,25,6],[26,2,26,6],[32,1,32,6]]}
[]
[null,"School Information"]
[null,"SCHOLASTIC"]
[]
[null,0,"E"]
[null,33,"D"]
[null,41,"C2"]
[null,51,"C1"]
[null,61,"B2"]
[null,71,"B1"]
[null,81,"A2"]
[null,91,"A1"]
[]
[]
[]
[]
[]
[]
[]
[]
[]
[]
[]
[]
[null,"School Name","Golden Valley School"]
[null,"Aff. No.",124568]
[null,"Address","Hanuman Gali, Pushkar, Rajasthan"]
[]
[null,"Email : demo@demomail.com"]
[null,"Ph. +91 999 999 9999"]
[]
[]
[null,"Academic Session: 2017-18"]
[null,{"$f":"\"Class : \" & MID(CELL(\"filename\",A1),SEARCH(\"[\",CELL(\"filename\",A1))+1,SEARCH(\".\",CELL(\"filename\",A1))-1-SEARCH(\"[\",CELL(\"filename\",A1)))","v":"Class : IX"}]

{"sheet":"PERCENTAGE","index":1,"n_rows":86,"n_cols":32,"rows_kept":86,"cut":false,"hidden":true,"merged":[[1,0,1,19],[0,0,0,19],[5,2,5,11],[5,12,5,21],[5,22,5,31],[2,2,2,21]]}
[]
[]
[]
["Roll No.","Name"]
[null,null,1,2,3,4,5,6,7,8,9,10,1,2,3,4,5,6,7,8,9,10,1,2,3,4,5,6,7,8,9,10]
[null,null,"PT1",null,null,null,null,null,null,null,null,null,"PT2",null,null,null,null,null,null,null,null,null,"PT3"]
[{"$f":"eSPAR!A6","v":1},{"$f":"eSPAR!B6","v":"Aman Kumar"},{"$f":"IF(eSUBWAR!$I$21=\"Valid\",eMARKS!C7,eMARKS!D7*1.3)","v":7},{"$f":"IF(eSUBWAR!$I$21=\"Valid\",eMARKS!D7,eMARKS!E7*1.3)","v":6},{"$f":"IF(eSUBWAR!$I$21=\"Valid\",eMARKS!E7,eMARKS!F7*1.3)","v":7},{"$f":"IF(eSUBWAR!$I$21=\"Valid\",eMARKS!F7,eMARKS!G7*1.3)","v":8},{"$f":"IF(eSUBWAR!$I$21=\"Valid\",eMARKS!G7,eMARKS!H7*1.3)","v":8},{"$f":"IF(eSUBWAR!$I$21=\"Valid\",eMARKS!H7,eMARKS!#REF!*1.2)","v":5},null,null,null,null,{"$f":"IF(eSUBWAR!$I$21=\"Valid\",eMARKS!I7,eMARKS!J7*1.2)","v":6},{"$f":"IF(eSUBWAR!$I$21=\"Valid\",eMARKS!J7,eMARKS!K7*1.2)","v":7},{"$f":"IF(eSUBWAR!$I$21=\"Valid\",eMARKS!K7,eMARKS!L7*1.2)","v":5},{"$f":"IF(eSUBWAR!$I$21=\"Valid\",eMARKS!L7,eMARKS!M7*1.2)","v":6},{"$f":"IF(eSUBWAR!$I$21=\"Valid\",eMARKS!M7,eMARKS!N7*1.2)","v":5},{"$f":"IF(eSUBWAR!$I$21=\"Valid\",eMARKS!N7,eMARKS!#REF!*1.2)","v":6},null,null,null,null,{"$f":"IF(eSUBWAR!$I$21=\"Valid\",eMARKS!O7,eMARKS!P7*1.2)","v":7},{"$f":"IF(eSUBWAR!$I$21=\"Valid\",eMARKS!P7,eMARKS!Q7*1.2)","v":8},{"$f":"IF(eSUBWAR!$I$21=\"Valid\",eMARKS!Q7,eMARKS!R7*1.2)","v":9},{"$f":"IF(eSUBWAR!$I$21=\"Valid\",eMARKS!R7,eMARKS!S7*1.2)","v":6},{"$f":"IF(eSUBWAR!$I$21=\"Valid\",eMARKS!S7,eMARKS!T7*1.2)","v":7},{"$f":"IF(eSUBWAR!$I$21=\"Valid\",eMARKS!T7,eMARKS!#REF!*1.2)","v":8}]
[{"$f":"eSPAR!A7","v":2},{"$f":"eSPAR!B7","v":0},{"$f":"IF(eSUBWAR!$I$21=\"Valid\",eMARKS!C8,eMARKS!D8*1.3)","v":0},{"$f":"IF(eSUBWAR!$I$21=\"Valid\",eMARKS!D8,eMARKS!E8*1.3)","v":0},{"$f":"IF(eSUBWAR!$I$21=\"Valid\",eMARKS!E8,eMARKS!F8*1.3)","v":0},{"$f":"IF(eSUBWAR!$I$21=\"Valid\",eMARKS!F8,eMARKS!G8*1.3)","v":0},{"$f":"IF(eSUBWAR!$I$21=\"Valid\",eMARKS!G8,eMARKS!H8*1.3)","v":0},{"$f":"IF(eSUBWAR!$I$21=\"Valid\",eMARKS!H8,eMARKS!#REF!*1.2)","v":0},null,null,null,null,{"$f":"IF(eSUBWAR!$I$21=\"Valid\",eMARKS!I8,eMARKS!J8*1.2)","v":0},{"$f":"IF(eSUBWAR!$I$21=\"Valid\",eMARKS!J8,eMARKS!K8*1.2)","v":0},{"$f":"IF(eSUBWAR!$I$21=\"Valid\",eMARKS!K8,eMARKS!L8*1.2)","v":0},{"$f":"IF(eSUBWAR!$I$21=\"Valid\",eMARKS!L8,eMARKS!M8*1.2)","v":0},{"$f":"IF(eSUBWAR!$I$21=\"Valid\",eMARKS!M8,eMARKS!N8*1.2)","v":0},{"$f":"IF(eSUBWAR!$I$21=\"Valid\",eMARKS!N8,eMARKS!#REF!*1.2)","v":0},null,null,null,null,{"$f":"IF(eSUBWAR!$I$21=\"Valid\",eMARKS!O8,eMARKS!P8*1.2)","v":0},{"$f":"IF(eSUBWAR!$I$21=\"Valid\",eMARKS!P8,eMARKS!Q8*1.2)","v":0},{"$f":"IF(eSUBWAR!$I$21=\"Valid\",eMARKS!Q8,eMARKS!R8*1.2)","v":0},{"$f":"IF(eSUBWAR!$I$21=\"Valid\",eMARKS!R8,eMARKS!S8*1.2)","v":0},{"$f":"IF(eSUBWAR!$I$21=\"Valid\",eMARKS!S8,eMARKS!T8*1.2)","v":0},{"$f":"IF(eSUBWAR!$I$21=\"Valid\",eMARKS!T8,eMARKS!#REF!*1.2)","v":0}]
[{"$f":"eSPAR!A8","v":0},{"$f":"eSPAR!B8","v":0},{"$f":"IF(eSUBWAR!$I$21=\"Valid\",eMARKS!C9,eMARKS!D9*1.3)","v":0},{"$f":"IF(eSUBWAR!$I$21=\"Valid\",eMARKS!D9,eMARKS!E9*1.3)","v":0},{"$f":"IF(eSUBWAR!$I$21=\"Valid\",eMARKS!E9,eMARKS!F9*1.3)","v":0},{"$f":"IF(eSUBWAR!$I$21=\"Valid\",eMARKS!F9,eMARKS!G9*1.3)","v":0},{"$f":"IF(eSUBWAR!$I$21=\"Valid\",eMARKS!G9,eMARKS!H9*1.3)","v":0},{"$f":"IF(eSUBWAR!$I$21=\"Valid\",eMARKS!H9,eMARKS!#REF!*1.2)","v":0},null,null,null,null,{"$f":"IF(eSUBWAR!$I$21=\"Valid\",eMARKS!I9,eMARKS!J9*1.2)","v":0},{"$f":"IF(eSUBWAR!$I$21=\"Valid\",eMARKS!J9,eMARKS!K9*1.2)","v":0},{"$f":"IF(eSUBWAR!$I$21=\"Valid\",eMARKS!K9,eMARKS!L9*1.2)","v":0},{"$f":"IF(eSUBWAR!$I$21=\"Valid\",eMARKS!L9,eMARKS!M9*1.2)","v":0},{"$f":"IF(eSUBWAR!$I$21=\"Valid\",eMARKS!M9,eMARKS!N9*1.2)","v":0},{"$f":"IF(eSUBWAR!$I$21=\"Valid\",eMARKS!N9,eMARKS!#REF!*1.2)","v":0},null,null,null,null,{"$f":"IF(eSUBWAR!$I$21=\"Valid\",eMARKS!O9,eMARKS!P9*1.2)","v":0},{"$f":"IF(eSUBWAR!$I$21=\"Valid\",eMARKS!P9,eMARKS!Q9*1.2)","v":0},{"$f":"IF(eSUBWAR!$I$21=\"Valid\",eMARKS!Q9,eMARKS!R9*1.2)","v":0},{"$f":"IF(eSUBWAR!$I$21=\"Valid\",eMARKS!R9,eMARKS!S9*1.2)","v":0},{"$f":"IF(eSUBWAR!$I$21=\"Valid\",eMARKS!S9,eMARKS!T9*1.2)","v":0},{"$f":"IF(eSUBWAR!$I$21=\"Valid\",eMARKS!T9,eMARKS!#REF!*1.2)","v":0}]
[{"$f":"eSPAR!A9","v":0},{"$f":"eSPAR!B9","v":0},{"$f":"IF(eSUBWAR!$I$21=\"Valid\",eMARKS!C10,eMARKS!D10*1.3)","v":0},{"$f":"IF(eSUBWAR!$I$21=\"Valid\",eMARKS!D10,eMARKS!E10*1.3)","v":0},{"$f":"IF(eSUBWAR!$I$21=\"Valid\",eMARKS!E10,eMARKS!F10*1.3)","v":0},{"$f":"IF(eSUBWAR!$I$21=\"Valid\",eMARKS!F10,eMARKS!G10*1.3)","v":0},{"$f":"IF(eSUBWAR!$I$21=\"Valid\",eMARKS!G10,eMARKS!H10*1.3)","v":0},{"$f":"IF(eSUBWAR!$I$21=\"Valid\",eMARKS!H10,eMARKS!#REF!*1.2)","v":0},null,null,null,null,{"$f":"IF(eSUBWAR!$I$21=\"Valid\",eMARKS!I10,eMARKS!J10*1.2)","v":0},{"$f":"IF(eSUBWAR!$I$21=\"Valid\",eMARKS!J10,eMARKS!K10*1.2)","v":0},{"$f":"IF(eSUBWAR!$I$21=\"Valid\",eMARKS!K10,eMARKS!L10*1.2)","v":0},{"$f":"IF(eSUBWAR!$I$21=\"Valid\",eMARKS!L10,eMARKS!M10*1.2)","v":0},{"$f":"IF(eSUBWAR!$I$21=\"Valid\",eMARKS!M10,eMARKS!N10*1.2)","v":0},{"$f":"IF(eSUBWAR!$I$21=\"Valid\",eMARKS!N10,eMARKS!#REF!*1.2)","v":0},null,null,null,null,{"$f":"IF(eSUBWAR!$I$21=\"Valid\",eMARKS!O10,eMARKS!P10*1.2)","v":0},{"$f":"IF(eSUBWAR!$I$21=\"Valid\",eMARKS!P10,eMARKS!Q10*1.2)","v":0},{"$f":"IF(eSUBWAR!$I$21=\"Valid\",eMARKS!Q10,eMARKS!R10*1.2)","v":0},{"$f":"IF(eSUBWAR!$I$21=\"Valid\",eMARKS!R10,eMARKS!S10*1.2)","v":0},{"$f":"IF(eSUBWAR!$I$21=\"Valid\",eMARKS!S10,eMARKS!T10*1.2)","v":0},{"$f":"IF(eSUBWAR!$I$21=\"Valid\",eMARKS!T10,eMARKS!#REF!*1.2)","v":0}]
[{"$f":"eSPAR!A10","v":0},{"$f":"eSPAR!B10","v":0},{"$f":"IF(eSUBWAR!$I$21=\"Valid\",eMARKS!C11,eMARKS!D11*1.3)","v":0},{"$f":"IF(eSUBWAR!$I$21=\"Valid\",eMARKS!D11,eMARKS!E11*1.3)","v":0},{"$f":"IF(eSUBWAR!$I$21=\"Valid\",eMARKS!E11,eMARKS!F11*1.3)","v":0},{"$f":"IF(eSUBWAR!$I$21=\"Valid\",eMARKS!F11,eMARKS!G11*1.3)","v":0},{"$f":"IF(eSUBWAR!$I$21=\"Valid\",eMARKS!G11,eMARKS!H11*1.3)","v":0},{"$f":"IF(eSUBWAR!$I$21=\"Valid\",eMARKS!H11,eMARKS!#REF!*0.8)","v":0},null,null,null,null,{"$f":"IF(eSUBWAR!$I$21=\"Valid\",eMARKS!I11,eMARKS!J11*1.2)","v":0},{"$f":"IF(eSUBWAR!$I$21=\"Valid\",eMARKS!J11,eMARKS!K11*1.2)","v":0},{"$f":"IF(eSUBWAR!$I$21=\"Valid\",eMARKS!K11,eMARKS!L11*1.2)","v":0},{"$f":"IF(eSUBWAR!$I$21=\"Valid\",eMARKS!L11,eMARKS!M11*1.2)","v":0},{"$f":"IF(eSUBWAR!$I$21=\"Valid\",eMARKS!M11,eMARKS!N11*1.2)","v":0},{"$f":"IF(eSUBWAR!$I$21=\"Valid\",eMARKS!N11,eMARKS!#REF!*1.2)","v":0},null,null,null,null,{"$f":"IF(eSUBWAR!$I$21=\"Valid\",eMARKS!O11,eMARKS!P11*0.8)","v":0},{"$f":"IF(eSUBWAR!$I$21=\"Valid\",eMARKS!P11,eMARKS!Q11*0.8)","v":0},{"$f":"IF(eSUBWAR!$I$21=\"Valid\",eMARKS!Q11,eMARKS!R11*0.8)","v":0},{"$f":"IF(eSUBWAR!$I$21=\"Valid\",eMARKS!R11,eMARKS!S11*1.2)","v":0},{"$f":"IF(eSUBWAR!$I$21=\"Valid\",eMARKS!S11,eMARKS!T11*1.2)","v":0},{"$f":"IF(eSUBWAR!$I$21=\"Valid\",eMARKS!T11,eMARKS!#REF!*1.2)","v":0}]
[{"$f":"eSPAR!A11","v":0},{"$f":"eSPAR!B11","v":0},{"$f":"IF(eSUBWAR!$I$21=\"Valid\",eMARKS!C12,eMARKS!D12*1.2)","v":0},{"$f":"IF(eSUBWAR!$I$21=\"Valid\",eMARKS!D12,eMARKS!E12*1.2)","v":0},{"$f":"IF(eSUBWAR!$I$21=\"Valid\",eMARKS!E12,eMARKS!F12*1.2)","v":0},{"$f":"IF(eSUBWAR!$I$21=\"Valid\",eMARKS!F12,eMARKS!G12*1.2)","v":0},{"$f":"IF(eSUBWAR!$I$21=\"Valid\",eMARKS!G12,eMARKS!H12*0.8)","v":0},{"$f":"IF(eSUBWAR!$I$21=\"Valid\",eMARKS!H12,eMARKS!#REF!*1.3)","v":0},null,null,null,null,{"$f":"IF(eSUBWAR!$I$21=\"Valid\",eMARKS!I12,eMARKS!J12*1.2)","v":0},{"$f":"IF(eSUBWAR!$I$21=\"Valid\",eMARKS!J12,eMARKS!K12*1.2)","v":0},{"$f":"IF(eSUBWAR!$I$21=\"Valid\",eMARKS!K12,eMARKS!L12*1.2)","v":0},{"$f":"IF(eSUBWAR!$I$21=\"Valid\",eMARKS!L12,eMARKS!M12*1.2)","v":0},{"$f":"IF(eSUBWAR!$I$21=\"Valid\",eMARKS!M12,eMARKS!N12*1.2)","v":0},{"$f":"IF(eSUBWAR!$I$21=\"Valid\",eMARKS!N12,eMARKS!#REF!*1.2)","v":0},null,null,null,null,{"$f":"IF(eSUBWAR!$I$21=\"Valid\",eMARKS!O12,eMARKS!P12*0.8)","v":0},{"$f":"IF(eSUBWAR!$I$21=\"Valid\",eMARKS!P12,eMARKS!Q12*0.8)","v":0},{"$f":"IF(eSUBWAR!$I$21=\"Valid\",eMARKS!Q12,eMARKS!R12*0.8)","v":0},{"$f":"IF(eSUBWAR!$I$21=\"Valid\",eMARKS!R12,eMARKS!S12*1.2)","v":0},{"$f":"IF(eSUBWAR!$I$21=\"Valid\",eMARKS!S12,eMARKS!T12*1.2)","v":0},{"$f":"IF(eSUBWAR!$I$21=\"Valid\",eMARKS!T12,eMARKS!#REF!*1.2)","v":0}]
[{"$f":"eSPAR!A12","v":0},{"$f":"eSPAR!B12","v":0},{"$f":"IF(eSUBWAR!$I$21=\"Valid\",eMARKS!C13,eMARKS!D13*1.2)","v":0},{"$f":"IF(eSUBWAR!$I$21=\"Valid\",eMARKS!D13,eMARKS!E13*1.2)","v":0},{"$f":"IF(eSUBWAR!$I$21=\"Valid\",eMARKS!E13,eMARKS!F13*1.2)","v":0},{"$f":"IF(eSUBWAR!$I$21=\"Valid\",eMARKS!F13,eMARKS!G13*1.2)","v":0},{"$f":"IF(eSUBWAR!$I$21=\"Valid\",eMARKS!G13,eMARKS!H13*0.8)","v":0},{"$f":"IF(eSUBWAR!$I$21=\"Valid\",eMARKS!H13,eMARKS!#REF!*1.3)","v":0},null,null,null,null,{"$f":"IF(eSUBWAR!$I$21=\"Valid\",eMARKS!I13,eMARKS!J13*1.2)","v":0},{"$f":"IF(eSUBWAR!$I$21=\"Valid\",eMARKS!J13,eMARKS!K13*1.2)","v":0},{"$f":"IF(eSUBWAR!$I$21=\"Valid\",eMARKS!K13,eMARKS!L13*1.2)","v":0},{"$f":"IF(eSUBWAR!$I$21=\"Valid\",eMARKS!L13,eMARKS!M13*1.2)","v":0},{"$f":"IF(eSUBWAR!$I$21=\"Valid\",eMARKS!M13,eMARKS!N13*1.2)","v":0},{"$f":"IF(eSUBWAR!$I$21=\"Valid\",eMARKS!N13,eMARKS!#REF!*1.2)","v":0},null,null,null,null,{"$f":"IF(eSUBWAR!$I$21=\"Valid\",eMARKS!O13,eMARKS!P13*0.8)","v":0},{"$f":"IF(eSUBWAR!$I$21=\"Valid\",eMARKS!P13,eMARKS!Q13*0.8)","v":0},{"$f":"IF(eSUBWAR!$I$21=\"Valid\",eMARKS!Q13,eMARKS!R13*0.8)","v":0},{"$f":"IF(eSUBWAR!$I$21=\"Valid\",eMARKS!R13,eMARKS!S13*1.2)","v":0},{"$f":"IF(eSUBWAR!$I$21=\"Valid\",eMARKS!S13,eMARKS!T13*1.2)","v":0},{"$f":"IF(eSUBWAR!$I$21=\"Valid\",eMARKS!T13,eMARKS!#REF!*1.2)","v":0}]
[{"$f":"eSPAR!A13","v":0},{"$f":"eSPAR!B13","v":0},{"$f":"IF(eSUBWAR!$I$21=\"Valid\",eMARKS!C14,eMARKS!D14*1.2)","v":0},{"$f":"IF(eSUBWAR!$I$21=\"Valid\",eMARKS!D14,eMARKS!E14*1.2)","v":0},{"$f":"IF(eSUBWAR!$I$21=\"Valid\",eMARKS!E14,eMARKS!F14*1.2)","v":0},{"$f":"IF(eSUBWAR!$I$21=\"Valid\",eMARKS!F14,eMARKS!G14*1.2)","v":0},{"$f":"IF(eSUBWAR!$I$21=\"Valid\",eMARKS!G14,eMARKS!H14*0.8)","v":0},{"$f":"IF(eSUBWAR!$I$21=\"Valid\",eMARKS!H14,eMARKS!#REF!*1.3)","v":0},null,null,null,null,{"$f":"IF(eSUBWAR!$I$21=\"Valid\",eMARKS!I14,eMARKS!J14*1.2)","v":0},{"$f":"IF(eSUBWAR!$I$21=\"Valid\",eMARKS!J14,eMARKS!K14*1.2)","v":0},{"$f":"IF(eSUBWAR!$I$21=\"Valid\",eMARKS!K14,eMARKS!L14*1.2)","v":0},{"$f":"IF(eSUBWAR!$I$21=\"Valid\",eMARKS!L14,eMARKS!M14*1.2)","v":0},{"$f":"IF(eSUBWAR!$I$21=\"Valid\",eMARKS!M14,eMARKS!N14*1.2)","v":0},{"$f":"IF(eSUBWAR!$I$21=\"Valid\",eMARKS!N14,eMARKS!#REF!*1.2)","v":0},null,null,null,null,{"$f":"IF(eSUBWAR!$I$21=\"Valid\",eMARKS!O14,eMARKS!P14*1.3)","v":0},{"$f":"IF(eSUBWAR!$I$21=\"Valid\",eMARKS!P14,eMARKS!Q14*1.3)","v":0},{"$f":"IF(eSUBWAR!$I$21=\"Valid\",eMARKS!Q14,eMARKS!R14*0.8)","v":0},{"$f":"IF(eSUBWAR!$I$21=\"Valid\",eMARKS!R14,eMARKS!S14*1.2)","v":0},{"$f":"IF(eSUBWAR!$I$21=\"Valid\",eMARKS!S14,eMARKS!T14*1.2)","v":0},{"$f":"IF(eSUBWAR!$I$21=\"Valid\",eMARKS!T14,eMARKS!#REF!*1.2)","v":0}]
[{"$f":"eSPAR!A14","v":0},{"$f":"eSPAR!B14","v":0},{"$f":"IF(eSUBWAR!$I$21=\"Valid\",eMARKS!C15,eMARKS!D15*1.2)","v":0},{"$f":"IF(eSUBWAR!$I$21=\"Valid\",eMARKS!D15,eMARKS!E15*1.2)","v":0},{"$f":"IF(eSUBWAR!$I$21=\"Valid\",eMARKS!E15,eMARKS!F15*1.2)","v":0},{"$f":"IF(eSUBWAR!$I$21=\"Valid\",eMARKS!F15,eMARKS!G15*1.2)","v":0},{"$f":"IF(eSUBWAR!$I$21=\"Valid\",eMARKS!G15,eMARKS!H15*0.8)","v":0},{"$f":"IF(eSUBWAR!$I$21=\"Valid\",eMARKS!H15,eMARKS!#REF!*1.3)","v":0},null,null,null,null,{"$f":"IF(eSUBWAR!$I$21=\"Valid\",eMARKS!I15,eMARKS!J15*1.2)","v":0},{"$f":"IF(eSUBWAR!$I$21=\"Valid\",eMARKS!J15,eMARKS!K15*1.2)","v":0},{"$f":"IF(eSUBWAR!$I$21=\"Valid\",eMARKS!K15,eMARKS!L15*1.2)","v":0},{"$f":"IF(eSUBWAR!$I$21=\"Valid\",eMARKS!L15,eMARKS!M15*1.2)","v":0},{"$f":"IF(eSUBWAR!$I$21=\"Valid\",eMARKS!M15,eMARKS!N15*1.2)","v":0},{"$f":"IF(eSUBWAR!$I$21=\"Valid\",eMARKS!N15,eMARKS!#REF!*1.2)","v":0},null,null,null,null,{"$f":"IF(eSUBWAR!$I$21=\"Valid\",eMARKS!O15,eMARKS!P15*1.3)","v":0},{"$f":"IF(eSUBWAR!$I$21=\"Valid\",eMARKS!P15,eMARKS!Q15*1.3)","v":0},{"$f":"IF(eSUBWAR!$I$21=\"Valid\",eMARKS!Q15,eMARKS!R15*0.8)","v":0},{"$f":"IF(eSUBWAR!$I$21=\"Valid\",eMARKS!R15,eMARKS!S15*1.2)","v":0},{"$f":"IF(eSUBWAR!$I$21=\"Valid\",eMARKS!S15,eMARKS!T15*1.2)","v":0},{"$f":"IF(eSUBWAR!$I$21=\"Valid\",eMARKS!T15,eMARKS!#REF!*1.2)","v":0}]
[{"$f":"eSPAR!A15","v":0},{"$f":"eSPAR!B15","v":0},{"$f":"IF(eSUBWAR!$I$21=\"Valid\",eMARKS!C16,eMARKS!D16*1.2)","v":0},{"$f":"IF(eSUBWAR!$I$21=\"Valid\",eMARKS!D16,eMARKS!E16*1.2)","v":0},{"$f":"IF(eSUBWAR!$I$21=\"Valid\",eMARKS!E16,eMARKS!F16*1.2)","v":0},{"$f":"IF(eSUBWAR!$I$21=\"Valid\",eMARKS!F16,eMARKS!G16*1.2)","v":0},{"$f":"IF(eSUBWAR!$I$21=\"Valid\",eMARKS!G16,eMARKS!H16*0.8)","v":0},{"$f":"IF(eSUBWAR!$I$21=\"Valid\",eMARKS!H16,eMARKS!#REF!*1.3)","v":0},null,null,null,null,{"$f":"IF(eSUBWAR!$I$21=\"Valid\",eMARKS!I16,eMARKS!J16*1.2)","v":0},{"$f":"IF(eSUBWAR!$I$21=\"Valid\",eMARKS!J16,eMARKS!K16*1.2)","v":0},{"$f":"IF(eSUBWAR!$I$21=\"Valid\",eMARKS!K16,eMARKS!L16*1.2)","v":0},{"$f":"IF(eSUBWAR!$I$21=\"Valid\",eMARKS!L16,eMARKS!M16*1.2)","v":0},{"$f":"IF(eSUBWAR!$I$21=\"Valid\",eMARKS!M16,eMARKS!N16*1.2)","v":0},{"$f":"IF(eSUBWAR!$I$21=\"Valid\",eMARKS!N16,eMARKS!#REF!*1.2)","v":0},null,null,null,null,{"$f":"IF(eSUBWAR!$I$21=\"Valid\",eMARKS!O16,eMARKS!P16*1.3)","v":0},{"$f":"IF(eSUBWAR!$I$21=\"Valid\",eMARKS!P16,eMARKS!Q16*1.3)","v":0},{"$f":"IF(eSUBWAR!$I$21=\"Valid\",eMARKS!Q16,eMARKS!R16*0.8)","v":0},{"$f":"IF(eSUBWAR!$I$21=\"Valid\",eMARKS!R16,eMARKS!S16*1.2)","v":0},{"$f":"IF(eSUBWAR!$I$21=\"Valid\",eMARKS!S16,eMARKS!T16*1.2)","v":0},{"$f":"IF(eSUBWAR!$I$21=\"Valid\",eMARKS!T16,eMARKS!#REF!*1.2)","v":0}]
[{"$f":"eSPAR!A16","v":0},{"$f":"eSPAR!B16","v":0},{"$f":"IF(eSUBWAR!$I$21=\"Valid\",eMARKS!C17,eMARKS!D17*1.2)","v":0},{"$f":"IF(eSUBWAR!$I$21=\"Valid\",eMARKS!D17,eMARKS!E17*1.2)","v":0},{"$f":"IF(eSUBWAR!$I$21=\"Valid\",eMARKS!E17,eMARKS!F17*1.2)","v":0},{"$f":"IF(eSUBWAR!$I$21=\"Valid\",eMARKS!F17,eMARKS!G17*1.2)","v":0},{"$f":"IF(eSUBWAR!$I$21=\"Valid\",eMARKS!G17,eMARKS!H17*1.2)","v":0},{"$f":"IF(eSUBWAR!$I$21=\"Valid\",eMARKS!H17,eMARKS!#REF!*1.2)","v":0},null,null,null,null,{"$f":"IF(eSUBWAR!$I$21=\"Valid\",eMARKS!I17,eMARKS!J17*1.2)","v":0},{"$f":"IF(eSUBWAR!$I$21=\"Valid\",eMARKS!J17,eMARKS!K17*1.2)","v":0},{"$f":"IF(eSUBWAR!$I$21=\"Valid\",eMARKS!K17,eMARKS!L17*1.2)","v":0},{"$f":"IF(eSUBWAR!$I$21=\"Valid\",eMARKS!L17,eMARKS!M17*1.2)","v":0},{"$f":"IF(eSUBWAR!$I$21=\"Valid\",eMARKS!M17,eMARKS!N17*1.2)","v":0},{"$f":"IF(eSUBWAR!$I$21=\"Valid\",eMARKS!N17,eMARKS!#REF!*1.2)","v":0},null,null,null,null,{"$f":"IF(eSUBWAR!$I$21=\"Valid\",eMARKS!O17,eMARKS!P17*1.3)","v":0},{"$f":"IF(eSUBWAR!$I$21=\"Valid\",eMARKS!P17,eMARKS!Q17*1.3)","v":0},{"$f":"IF(eSUBWAR!$I$21=\"Valid\",eMARKS!Q17,eMARKS!R17*1.2)","v":0},{"$f":"IF(eSUBWAR!$I$21=\"Valid\",eMARKS!R17,eMARKS!S17*1.2)","v":0},{"$f":"IF(eSUBWAR!$I$21=\"Valid\",eMARKS!S17,eMARKS!T17*1.2)","v":0},{"$f":"IF(eSUBWAR!$I$21=\"Valid\",eMARKS!T17,eMARKS!#REF!*1.2)","v":0}]
[{"$f":"eSPAR!A17","v":0},{"$f":"eSPAR!B17","v":0},{"$f":"IF(eSUBWAR!$I$21=\"Valid\",eMARKS!C18,eMARKS!D18*1.2)","v":0},{"$f":"IF(eSUBWAR!$I$21=\"Valid\",eMARKS!D18,eMARKS!E18*1.2)","v":0},{"$f":"IF(eSUBWAR!$I$21=\"Valid\",eMARKS!E18,eMARKS!F18*1.2)","v":0},{"$f":"IF(eSUBWAR!$I$21=\"Valid\",eMARKS!F18,eMARKS!G18*1.2)","v":0},{"$f":"IF(eSUBWAR!$I$21=\"Valid\",eMARKS!G18,eMARKS!H18*1.2)","v":0},{"$f":"IF(eSUBWAR!$I$21=\"Valid\",eMARKS!H18,eMARKS!#REF!*1.2)","v":0},null,null,null,null,{"$f":"IF(eSUBWAR!$I$21=\"Valid\",eMARKS!I18,eMARKS!J18*1.2)","v":0},{"$f":"IF(eSUBWAR!$I$21=\"Valid\",eMARKS!J18,eMARKS!K18*1.2)","v":0},{"$f":"IF(eSUBWAR!$I$21=\"Valid\",eMARKS!K18,eMARKS!L18*1.2)","v":0},{"$f":"IF(eSUBWAR!$I$21=\"Valid\",eMARKS!L18,eMARKS!M18*1.2)","v":0},{"$f":"IF(eSUBWAR!$I$21=\"Valid\",eMARKS!M18,eMARKS!N18*1.2)","v":0},{"$f":"IF(eSUBWAR!$I$21=\"Valid\",eMARKS!N18,eMARKS!#REF!*1.2)","v":0},null,null,null,null,{"$f":"IF(eSUBWAR!$I$21=\"Valid\",eMARKS!O18,eMARKS!P18*1.3)","v":0},{"$f":"IF(eSUBWAR!$I$21=\"Valid\",eMARKS!P18,eMARKS!Q18*1.3)","v":0},{"$f":"IF(eSUBWAR!$I$21=\"Valid\",eMARKS!Q18,eMARKS!R18*1.2)","v":0},{"$f":"IF(eSUBWAR!$I$21=\"Valid\",eMARKS!R18,eMARKS!S18*1.2)","v":0},{"$f":"IF(eSUBWAR!$I$21=\"Valid\",eMARKS!S18,eMARKS!T18*1.2)","v":0},{"$f":"IF(eSUBWAR!$I$21=\"Valid\",eMARKS!T18,eMARKS!#REF!*1.2)","v":0}]
[{"$f":"eSPAR!A18","v":0},{"$f":"eSPAR!B18","v":0},{"$f":"IF(eSUBWAR!$I$21=\"Valid\",eMARKS!C19,eMARKS!D19*1.2)","v":0},{"$f":"IF(eSUBWAR!$I$21=\"Valid\",eMARKS!D19,eMARKS!E19*1.2)","v":0},{"$f":"IF(eSUBWAR!$I$21=\"Valid\",eMARKS!E19,eMARKS!F19*1.2)","v":0},{"$f":"IF(eSUBWAR!$I$21=\"Valid\",eMARKS!F19,eMARKS!G19*1.2)","v":0},{"$f":"IF(eSUBWAR!$I$21=\"Valid\",eMARKS!G19,eMARKS!H19*1.2)","v":0},{"$f":"IF(eSUBWAR!$I$21=\"Valid\",eMARKS!H19,eMARKS!#REF!*1.2)","v":0},null,null,null,null,{"$f":"IF(eSUBWAR!$I$21=\"Valid\",eMARKS!I19,eMARKS!J19*1.2)","v":0},{"$f":"IF(eSUBWAR!$I$21=\"Valid\",eMARKS!J19,eMARKS!K19*1.2)","v":0},{"$f":"IF(eSUBWAR!$I$21=\"Valid\",eMARKS!K19,eMARKS!L19*1.2)","v":0},{"$f":"IF(eSUBWAR!$I$21=\"Valid\",eMARKS!L19,eMARKS!M19*1.2)","v":0},{"$f":"IF(eSUBWAR!$I$21=\"Valid\",eMARKS!M19,eMARKS!N19*1.2)","v":0},{"$f":"IF(eSUBWAR!$I$21=\"Valid\",eMARKS!N19,eMARKS!#REF!*1.2)","v":0},null,null,null,null,{"$f":"IF(eSUBWAR!$I$21=\"Valid\",eMARKS!O19,eMARKS!P19*1.3)","v":0},{"$f":"IF(eSUBWAR!$I$21=\"Valid\",eMARKS!P19,eMARKS!Q19*1.3)","v":0},{"$f":"IF(eSUBWAR!$I$21=\"Valid\",eMARKS!Q19,eMARKS!R19*1.2)","v":0},{"$f":"IF(eSUBWAR!$I$21=\"Valid\",eMARKS!R19,eMARKS!S19*1.2)","v":0},{"$f":"IF(eSUBWAR!$I$21=\"Valid\",eMARKS!S19,eMARKS!T19*1.2)","v":0},{"$f":"IF(eSUBWAR!$I$21=\"Valid\",eMARKS!T19,eMARKS!#REF!*1.2)","v":0}]
[{"$f":"eSPAR!A19","v":0},{"$f":"eSPAR!B19","v":0},{"$f":"IF(eSUBWAR!$I$21=\"Valid\",eMARKS!C20,eMARKS!D20*1.2)","v":0},{"$f":"IF(eSUBWAR!$I$21=\"Valid\",eMARKS!D20,eMARKS!E20*1.2)","v":0},{"$f":"IF(eSUBWAR!$I$21=\"Valid\",eMARKS!E20,eMARKS!F20*1.2)","v":0},{"$f":"IF(eSUBWAR!$I$21=\"Valid\",eMARKS!F20,eMARKS!G20*1.2)","v":0},{"$f":"IF(eSUBWAR!$I$21=\"Valid\",eMARKS!G20,eMARKS!H20*1.2)","v":0},{"$f":"IF(eSUBWAR!$I$21=\"Valid\",eMARKS!H20,eMARKS!#REF!*1.2)","v":0},null,null,null,null,{"$f":"IF(eSUBWAR!$I$21=\"Valid\",eMARKS!I20,eMARKS!J20*1.2)","v":0},{"$f":"IF(eSUBWAR!$I$21=\"Valid\",eMARKS!J20,eMARKS!K20*1.2)","v":0},{"$f":"IF(eSUBWAR!$I$21=\"Valid\",eMARKS!K20,eMARKS!L20*1.2)","v":0},{"$f":"IF(eSUBWAR!$I$21=\"Valid\",eMARKS!L20,eMARKS!M20*1.2)","v":0},{"$f":"IF(eSUBWAR!$I$21=\"Valid\",eMARKS!M20,eMARKS!N20*1.2)","v":0},{"$f":"IF(eSUBWAR!$I$21=\"Valid\",eMARKS!N20,eMARKS!#REF!*1.2)","v":0},null,null,null,null,{"$f":"IF(eSUBWAR!$I$21=\"Valid\",eMARKS!O20,eMARKS!P20*1.2)","v":0},{"$f":"IF(eSUBWAR!$I$21=\"Valid\",eMARKS!P20,eMARKS!Q20*1.2)","v":0},{"$f":"IF(eSUBWAR!$I$21=\"Valid\",eMARKS!Q20,eMARKS!R20*1.2)","v":0},{"$f":"IF(eSUBWAR!$I$21=\"Valid\",eMARKS!R20,eMARKS!S20*1.2)","v":0},{"$f":"IF(eSUBWAR!$I$21=\"Valid\",eMARKS!S20,eMARKS!T20*1.2)","v":0},{"$f":"IF(eSUBWAR!$I$21=\"Valid\",eMARKS!T20,eMARKS!#REF!*1.2)","v":0}]
[{"$f":"eSPAR!A20","v":0},{"$f":"eSPAR!B20","v":0},{"$f":"IF(eSUBWAR!$I$21=\"Valid\",eMARKS!C21,eMARKS!D21*1.2)","v":0},{"$f":"IF(eSUBWAR!$I$21=\"Valid\",eMARKS!D21,eMARKS!E21*1.2)","v":0},{"$f":"IF(eSUBWAR!$I$21=\"Valid\",eMARKS!E21,eMARKS!F21*1.2)","v":0},{"$f":"IF(eSUBWAR!$I$21=\"Valid\",eMARKS!F21,eMARKS!G21*1.3)","v":0},{"$f":"IF(eSUBWAR!$I$21=\"Valid\",eMARKS!G21,eMARKS!H21*1.3)","v":0},{"$f":"IF(eSUBWAR!$I$21=\"Valid\",eMARKS!H21,eMARKS!#REF!*1.3)","v":0},null,null,null,null,{"$f":"IF(eSUBWAR!$I$21=\"Valid\",eMARKS!I21,eMARKS!J21*1.2)","v":0},{"$f":"IF(eSUBWAR!$I$21=\"Valid\",eMARKS!J21,eMARKS!K21*1.2)","v":0},{"$f":"IF(eSUBWAR!$I$21=\"Valid\",eMARKS!K21,eMARKS!L21*1.2)","v":0},{"$f":"IF(eSUBWAR!$I$21=\"Valid\",eMARKS!L21,eMARKS!M21*1.2)","v":0},{"$f":"IF(eSUBWAR!$I$21=\"Valid\",eMARKS!M21,eMARKS!N21*1.7)","v":0},{"$f":"IF(eSUBWAR!$I$21=\"Valid\",eMARKS!N21,eMARKS!#REF!*1.7)","v":0},null,null,null,null,{"$f":"IF(eSUBWAR!$I$21=\"Valid\",eMARKS!O21,eMARKS!P21*1.7)","v":0},{"$f":"IF(eSUBWAR!$I$21=\"Valid\",eMARKS!P21,eMARKS!Q21*1.7)","v":0},{"$f":"IF(eSUBWAR!$I$21=\"Valid\",eMARKS!Q21,eMARKS!R21*1.7)","v":0},{"$f":"IF(eSUBWAR!$I$21=\"Valid\",eMARKS!R21,eMARKS!S21*1.7)","v":0},{"$f":"IF(eSUBWAR!$I$21=\"Valid\",eMARKS!S21,eMARKS!T21*1.7)","v":0},{"$f":"IF(eSUBWAR!$I$21=\"Valid\",eMARKS!T21,eMARKS!#REF!*1.7)","v":0}]
[{"$f":"eSPAR!A21","v":0},{"$f":"eSPAR!B21","v":0},{"$f":"IF(eSUBWAR!$I$21=\"Valid\",eMARKS!C22,eMARKS!D22*1.2)","v":0},{"$f":"IF(eSUBWAR!$I$21=\"Valid\",eMARKS!D22,eMARKS!E22*1.2)","v":0},{"$f":"IF(eSUBWAR!$I$21=\"Valid\",eMARKS!E22,eMARKS!F22*1.2)","v":0},{"$f":"IF(eSUBWAR!$I$21=\"Valid\",eMARKS!F22,eMARKS!G22*1.3)","v":0},{"$f":"IF(eSUBWAR!$I$21=\"Valid\",eMARKS!G22,eMARKS!H22*1.3)","v":0},{"$f":"IF(eSUBWAR!$I$21=\"Valid\",eMARKS!H22,eMARKS!#REF!*1.3)","v":0},null,null,null,null,{"$f":"IF(eSUBWAR!$I$21=\"Valid\",eMARKS!I22,eMARKS!J22*1.2)","v":0},{"$f":"IF(eSUBWAR!$I$21=\"Valid\",eMARKS!J22,eMARKS!K22*1.2)","v":0},{"$f":"IF(eSUBWAR!$I$21=\"Valid\",eMARKS!K22,eMARKS!L22*1.2)","v":0},{"$f":"IF(eSUBWAR!$I$21=\"Valid\",eMARKS!L22,eMARKS!M22*1.2)","v":0},{"$f":"IF(eSUBWAR!$I$21=\"Valid\",eMARKS!M22,eMARKS!N22*1.7)","v":0},{"$f":"IF(eSUBWAR!$I$21=\"Valid\",eMARKS!N22,eMARKS!#REF!*1.7)","v":0},null,null,null,null,{"$f":"IF(eSUBWAR!$I$21=\"Valid\",eMARKS!O22,eMARKS!P22*1.7)","v":0},{"$f":"IF(eSUBWAR!$I$21=\"Valid\",eMARKS!P22,eMARKS!Q22*1.7)","v":0},{"$f":"IF(eSUBWAR!$I$21=\"Valid\",eMARKS!Q22,eMARKS!R22*1.7)","v":0},{"$f":"IF(eSUBWAR!$I$21=\"Valid\",eMARKS!R22,eMARKS!S22*1.7)","v":0},{"$f":"IF(eSUBWAR!$I$21=\"Valid\",eMARKS!S22,eMARKS!T22*1.7)","v":0},{"$f":"IF(eSUBWAR!$I$21=\"Valid\",eMARKS!T22,eMARKS!#REF!*1.7)","v":0}]
[{"$f":"eSPAR!A22","v":0},{"$f":"eSPAR!B22","v":0},{"$f":"IF(eSUBWAR!$I$21=\"Valid\",eMARKS!C23,eMARKS!D23*1.2)","v":0},{"$f":"IF(eSUBWAR!$I$21=\"Valid\",eMARKS!D23,eMARKS!E23*1.2)","v":0},{"$f":"IF(eSUBWAR!$I$21=\"Valid\",eMARKS!E23,eMARKS!F23*1.2)","v":0},{"$f":"IF(eSUBWAR!$I$21=\"Valid\",eMARKS!F23,eMARKS!G23*1.3)","v":0},{"$f":"IF(eSUBWAR!$I$21=\"Valid\",eMARKS!G23,eMARKS!H23*1.3)","v":0},{"$f":"IF(eSUBWAR!$I$21=\"Valid\",eMARKS!H23,eMARKS!#REF!*1.3)","v":0},null,null,null,null,{"$f":"IF(eSUBWAR!$I$21=\"Valid\",eMARKS!I23,eMARKS!J23*1.3)","v":0},{"$f":"IF(eSUBWAR!$I$21=\"Valid\",eMARKS!J23,eMARKS!K23*1.3)","v":0},{"$f":"IF(eSUBWAR!$I$21=\"Valid\",eMARKS!K23,eMARKS!L23*1.3)","v":0},{"$f":"IF(eSUBWAR!$I$21=\"Valid\",eMARKS!L23,eMARKS!M23*1.3)","v":0},{"$f":"IF(eSUBWAR!$I$21=\"Valid\",eMARKS!M23,eMARKS!N23*1.2)","v":0},{"$f":"IF(eSUBWAR!$I$21=\"Valid\",eMARKS!N23,eMARKS!#REF!*1.2)","v":0},null,null,null,null,{"$f":"IF(eSUBWAR!$I$21=\"Valid\",eMARKS!O23,eMARKS!P23*1.2)","v":0},{"$f":"IF(eSUBWAR!$I$21=\"Valid\",eMARKS!P23,eMARKS!Q23*1.2)","v":0},{"$f":"IF(eSUBWAR!$I$21=\"Valid\",eMARKS!Q23,eMARKS!R23*1.2)","v":0},{"$f":"IF(eSUBWAR!$I$21=\"Valid\",eMARKS!R23,eMARKS!S23*1.2)","v":0},{"$f":"IF(eSUBWAR!$I$21=\"Valid\",eMARKS!S23,eMARKS!T23*1.2)","v":0},{"$f":"IF(eSUBWAR!$I$21=\"Valid\",eMARKS!T23,eMARKS!#REF!*1.2)","v":0}]
[{"$f":"eSPAR!A23","v":0},{"$f":"eSPAR!B23","v":0},{"$f":"IF(eSUBWAR!$I$21=\"Valid\",eMARKS!C24,eMARKS!D24*1.2)","v":0},{"$f":"IF(eSUBWAR!$I$21=\"Valid\",eMARKS!D24,eMARKS!E24*1.2)","v":0},{"$f":"IF(eSUBWAR!$I$21=\"Valid\",eMARKS!E24,eMARKS!F24*1.2)","v":0},{"$f":"IF(eSUBWAR!$I$21=\"Valid\",eMARKS!F24,eMARKS!G24*1.3)","v":0},{"$f":"IF(eSUBWAR!$I$21=\"Valid\",eMARKS!G24,eMARKS!H24*1.3)","v":0},{"$f":"IF(eSUBWAR!$I$21=\"Valid\",eMARKS!H24,eMARKS!#REF!*1.3)","v":0},null,null,null,null,{"$f":"IF(eSUBWAR!$I$21=\"Valid\",eMARKS!I24,eMARKS!J24*1.3)","v":0},{"$f":"IF(eSUBWAR!$I$21=\"Valid\",eMARKS!J24,eMARKS!K24*1.3)","v":0},{"$f":"IF(eSUBWAR!$I$21=\"Valid\",eMARKS!K24,eMARKS!L24*1.3)","v":0},{"$f":"IF(eSUBWAR!$I$21=\"Valid\",eMARKS!L24,eMARKS!M24*1.3)","v":0},{"$f":"IF(eSUBWAR!$I$21=\"Valid\",eMARKS!M24,eMARKS!N24*1.2)","v":0},{"$f":"IF(eSUBWAR!$I$21=\"Valid\",eMARKS!N24,eMARKS!#REF!*1.2)","v":0},null,null,null,null,{"$f":"IF(eSUBWAR!$I$21=\"Valid\",eMARKS!O24,eMARKS!P24*1.2)","v":0},{"$f":"IF(eSUBWAR!$I$21=\"Valid\",eMARKS!P24,eMARKS!Q24*1.2)","v":0},{"$f":"IF(eSUBWAR!$I$21=\"Valid\",eMARKS!Q24,eMARKS!R24*1.2)","v":0},{"$f":"IF(eSUBWAR!$I$21=\"Valid\",eMARKS!R24,eMARKS!S24*1.2)","v":0},{"$f":"IF(eSUBWAR!$I$21=\"Valid\",eMARKS!S24,eMARKS!T24*1.2)","v":0},{"$f":"IF(eSUBWAR!$I$21=\"Valid\",eMARKS!T24,eMARKS!#REF!*1.2)","v":0}]
[{"$f":"eSPAR!A24","v":0},{"$f":"eSPAR!B24","v":0},{"$f":"IF(eSUBWAR!$I$21=\"Valid\",eMARKS!C25,eMARKS!D25*1.2)","v":0},{"$f":"IF(eSUBWAR!$I$21=\"Valid\",eMARKS!D25,eMARKS!E25*1.2)","v":0},{"$f":"IF(eSUBWAR!$I$21=\"Valid\",eMARKS!E25,eMARKS!F25*1.2)","v":0},{"$f":"IF(eSUBWAR!$I$21=\"Valid\",eMARKS!F25,eMARKS!G25*1.3)","v":0},{"$f":"IF(eSUBWAR!$I$21=\"Valid\",eMARKS!G25,eMARKS!H25*1.3)","v":0},{"$f":"IF(eSUBWAR!$I$21=\"Valid\",eMARKS!H25,eMARKS!#REF!*1.3)","v":0},null,null,null,null,{"$f":"IF(eSUBWAR!$I$21=\"Valid\",eMARKS!I25,eMARKS!J25*1.3)","v":0},{"$f":"IF(eSUBWAR!$I$21=\"Valid\",eMARKS!J25,eMARKS!K25*1.3)","v":0},{"$f":"IF(eSUBWAR!$I$21=\"Valid\",eMARKS!K25,eMARKS!L25*1.3)","v":0},{"$f":"IF(eSUBWAR!$I$21=\"Valid\",eMARKS!L25,eMARKS!M25*1.3)","v":0},{"$f":"IF(eSUBWAR!$I$21=\"Valid\",eMARKS!M25,eMARKS!N25*1.2)","v":0},{"$f":"IF(eSUBWAR!$I$21=\"Valid\",eMARKS!N25,eMARKS!#REF!*1.2)","v":0},null,null,null,null,{"$f":"IF(eSUBWAR!$I$21=\"Valid\",eMARKS!O25,eMARKS!P25*1.2)","v":0},{"$f":"IF(eSUBWAR!$I$21=\"Valid\",eMARKS!P25,eMARKS!Q25*0.8)","v":0},{"$f":"IF(eSUBWAR!$I$21=\"Valid\",eMARKS!Q25,eMARKS!R25*0.8)","v":0},{"$f":"IF(eSUBWAR!$I$21=\"Valid\",eMARKS!R25,eMARKS!S25*0.8)","v":0},{"$f":"IF(eSUBWAR!$I$21=\"Valid\",eMARKS!S25,eMARKS!T25*0.8)","v":0},{"$f":"IF(eSUBWAR!$I$21=\"Valid\",eMARKS!T25,eMARKS!#REF!*0.8)","v":0}]
[{"$f":"eSPAR!A25","v":0},{"$f":"eSPAR!B25","v":0},{"$f":"IF(eSUBWAR!$I$21=\"Valid\",eMARKS!C26,eMARKS!D26*1.2)","v":0},{"$f":"IF(eSUBWAR!$I$21=\"Valid\",eMARKS!D26,eMARKS!E26*1.2)","v":0},{"$f":"IF(eSUBWAR!$I$21=\"Valid\",eMARKS!E26,eMARKS!F26*1.2)","v":0},{"$f":"IF(eSUBWAR!$I$21=\"Valid\",eMARKS!F26,eMARKS!G26*1.3)","v":0},{"$f":"IF(eSUBWAR!$I$21=\"Valid\",eMARKS!G26,eMARKS!H26*1.3)","v":0},{"$f":"IF(eSUBWAR!$I$21=\"Valid\",eMARKS!H26,eMARKS!#REF!*1.3)","v":0},null,null,null,null,{"$f":"IF(eSUBWAR!$I$21=\"Valid\",eMARKS!I26,eMARKS!J26*1.3)","v":0},{"$f":"IF(eSUBWAR!$I$21=\"Valid\",eMARKS!J26,eMARKS!K26*1.3)","v":0},{"$f":"IF(eSUBWAR!$I$21=\"Valid\",eMARKS!K26,eMARKS!L26*1.3)","v":0},{"$f":"IF(eSUBWAR!$I$21=\"Valid\",eMARKS!L26,eMARKS!M26*1.3)","v":0},{"$f":"IF(eSUBWAR!$I$21=\"Valid\",eMARKS!M26,eMARKS!N26*1.2)","v":0},{"$f":"IF(eSUBWAR!$I$21=\"Valid\",eMARKS!N26,eMARKS!#REF!*1.2)","v":0},null,null,null,null,{"$f":"IF(eSUBWAR!$I$21=\"Valid\",eMARKS!O26,eMARKS!P26*1.2)","v":0},{"$f":"IF(eSUBWAR!$I$21=\"Valid\",eMARKS!P26,eMARKS!Q26*0.8)","v":0},{"$f":"IF(eSUBWAR!$I$21=\"Valid\",eMARKS!Q26,eMARKS!R26*0.8)","v":0},{"$f":"IF(eSUBWAR!$I$21=\"Valid\",eMARKS!R26,eMARKS!S26*0.8)","v":0},{"$f":"IF(eSUBWAR!$I$21=\"Valid\",eMARKS!S26,eMARKS!T26*0.8)","v":0},{"$f":"IF(eSUBWAR!$I$21=\"Valid\",eMARKS!T26,eMARKS!#REF!*0.8)","v":0}]
[{"$f":"eSPAR!A26","v":0},{"$f":"eSPAR!B26","v":0},{"$f":"IF(eSUBWAR!$I$21=\"Valid\",eMARKS!C27,eMARKS!D27*1.2)","v":0},{"$f":"IF(eSUBWAR!$I$21=\"Valid\",eMARKS!D27,eMARKS!E27*1.2)","v":0},{"$f":"IF(eSUBWAR!$I$21=\"Valid\",eMARKS!E27,eMARKS!F27*1.2)","v":0},{"$f":"IF(eSUBWAR!$I$21=\"Valid\",eMARKS!F27,eMARKS!G27*1.2)","v":0},{"$f":"IF(eSUBWAR!$I$21=\"Valid\",eMARKS!G27,eMARKS!H27*1.2)","v":0},{"$f":"IF(eSUBWAR!$I$21=\"Valid\",eMARKS!H27,eMARKS!#REF!*1.2)","v":0},null,null,null,null,{"$f":"IF(eSUBWAR!$I$21=\"Valid\",eMARKS!I27,eMARKS!J27*1.3)","v":0},{"$f":"IF(eSUBWAR!$I$21=\"Valid\",eMARKS!J27,eMARKS!K27*1.3)","v":0},{"$f":"IF(eSUBWAR!$I$21=\"Valid\",eMARKS!K27,eMARKS!L27*1.3)","v":0},{"$f":"IF(eSUBWAR!$I$21=\"Valid\",eMARKS!L27,eMARKS!M27*1.3)","v":0},{"$f":"IF(eSUBWAR!$I$21=\"Valid\",eMARKS!M27,eMARKS!N27*1.2)","v":0},{"$f":"IF(eSUBWAR!$I$21=\"Valid\",eMARKS!N27,eMARKS!#REF!*1.2)","v":0},null,null,null,null,{"$f":"IF(eSUBWAR!$I$21=\"Valid\",eMARKS!O27,eMARKS!P27*1.3)","v":0},{"$f":"IF(eSUBWAR!$I$21=\"Valid\",eMARKS!P27,eMARKS!Q27*1.3)","v":0},{"$f":"IF(eSUBWAR!$I$21=\"Valid\",eMARKS!Q27,eMARKS!R27*1.3)","v":0},{"$f":"IF(eSUBWAR!$I$21=\"Valid\",eMARKS!R27,eMARKS!S27*1.3)","v":0},{"$f":"IF(eSUBWAR!$I$21=\"Valid\",eMARKS!S27,eMARKS!T27*1.3)","v":0},{"$f":"IF(eSUBWAR!$I$21=\"Valid\",eMARKS!T27,eMARKS!#REF!*1.3)","v":0}]
[{"$f":"eSPAR!A27","v":0},{"$f":"eSPAR!B27","v":0},{"$f":"IF(eSUBWAR!$I$21=\"Valid\",eMARKS!C28,eMARKS!D28*1.2)","v":0},{"$f":"IF(eSUBWAR!$I$21=\"Valid\",eMARKS!D28,eMARKS!E28*1.2)","v":0},{"$f":"IF(eSUBWAR!$I$21=\"Valid\",eMARKS!E28,eMARKS!F28*1.2)","v":0},{"$f":"IF(eSUBWAR!$I$21=\"Valid\",eMARKS!F28,eMARKS!G28*1.2)","v":0},{"$f":"IF(eSUBWAR!$I$21=\"Valid\",eMARKS!G28,eMARKS!H28*1.2)","v":0},{"$f":"IF(eSUBWAR!$I$21=\"Valid\",eMARKS!H28,eMARKS!#REF!*1.2)","v":0},null,null,null,null,{"$f":"IF(eSUBWAR!$I$21=\"Valid\",eMARKS!I28,eMARKS!J28*1.3)","v":0},{"$f":"IF(eSUBWAR!$I$21=\"Valid\",eMARKS!J28,eMARKS!K28*1.3)","v":0},{"$f":"IF(eSUBWAR!$I$21=\"Valid\",eMARKS!K28,eMARKS!L28*1.3)","v":0},{"$f":"IF(eSUBWAR!$I$21=\"Valid\",eMARKS!L28,eMARKS!M28*1.3)","v":0},{"$f":"IF(eSUBWAR!$I$21=\"Valid\",eMARKS!M28,eMARKS!N28*1.2)","v":0},{"$f":"IF(eSUBWAR!$I$21=\"Valid\",eMARKS!N28,eMARKS!#REF!*1.2)","v":0},null,null,null,null,{"$f":"IF(eSUBWAR!$I$21=\"Valid\",eMARKS!O28,eMARKS!P28*1.3)","v":0},{"$f":"IF(eSUBWAR!$I$21=\"Valid\",eMARKS!P28,eMARKS!Q28*1.3)","v":0},{"$f":"IF(eSUBWAR!$I$21=\"Valid\",eMARKS!Q28,eMARKS!R28*1.3)","v":0},{"$f":"IF(eSUBWAR!$I$21=\"Valid\",eMARKS!R28,eMARKS!S28*1.3)","v":0},{"$f":"IF(eSUBWAR!$I$21=\"Valid\",eMARKS!S28,eMARKS!T28*1.3)","v":0},{"$f":"IF(eSUBWAR!$I$21=\"Valid\",eMARKS!T28,eMARKS!#REF!*1.3)","v":0}]
[{"$f":"eSPAR!A28","v":0},{"$f":"eSPAR!B28","v":0},{"$f":"IF(eSUBWAR!$I$21=\"Valid\",eMARKS!C29,eMARKS!D29*1.2)","v":0},{"$f":"IF(eSUBWAR!$I$21=\"Valid\",eMARKS!D29,eMARKS!E29*1.2)","v":0},{"$f":"IF(eSUBWAR!$I$21=\"Valid\",eMARKS!E29,eMARKS!F29*1.2)","v":0},{"$f":"IF(eSUBWAR!$I$21=\"Valid\",eMARKS!F29,eMARKS!G29*1.2)","v":0},{"$f":"IF(eSUBWAR!$I$21=\"Valid\",eMARKS!G29,eMARKS!H29*1.2)","v":0},{"$f":"IF(eSUBWAR!$I$21=\"Valid\",eMARKS!H29,eMARKS!#REF!*1.2)","v":0},null,null,null,null,{"$f":"IF(eSUBWAR!$I$21=\"Valid\",eMARKS!I29,eMARKS!J29*1.3)","v":0},{"$f":"IF(eSUBWAR!$I$21=\"Valid\",eMARKS!J29,eMARKS!K29*1.3)","v":0},{"$f":"IF(eSUBWAR!$I$21=\"Valid\",eMARKS!K29,eMARKS!L29*1.3)","v":0},{"$f":"IF(eSUBWAR!$I$21=\"Valid\",eMARKS!L29,eMARKS!M29*1.3)","v":0},{"$f":"IF(eSUBWAR!$I$21=\"Valid\",eMARKS!M29,eMARKS!N29*1.2)","v":0},{"$f":"IF(eSUBWAR!$I$21=\"Valid\",eMARKS!N29,eMARKS!#REF!*1.2)","v":0},null,null,null,null,{"$f":"IF(eSUBWAR!$I$21=\"Valid\",eMARKS!O29,eMARKS!P29*1.3)","v":0},{"$f":"IF(eSUBWAR!$I$21=\"Valid\",eMARKS!P29,eMARKS!Q29*1.3)","v":0},{"$f":"IF(eSUBWAR!$I$21=\"Valid\",eMARKS!Q29,eMARKS!R29*1.3)","v":0},{"$f":"IF(eSUBWAR!$I$21=\"Valid\",eMARKS!R29,eMARKS!S29*1.3)","v":0},{"$f":"IF(eSUBWAR!$I$21=\"Valid\",eMARKS!S29,eMARKS!T29*1.3)","v":0},{"$f":"IF(eSUBWAR!$I$21=\"Valid\",eMARKS!T29,eMARKS!#REF!*1.3)","v":0}]
[{"$f":"eSPAR!A29","v":0},{"$f":"eSPAR!B29","v":0},{"$f":"IF(eSUBWAR!$I$21=\"Valid\",eMARKS!C30,eMARKS!D30*1.2)","v":0},{"$f":"IF(eSUBWAR!$I$21=\"Valid\",eMARKS!D30,eMARKS!E30*1.2)","v":0},{"$f":"IF(eSUBWAR!$I$21=\"Valid\",eMARKS!E30,eMARKS!F30*1.2)","v":0},{"$f":"IF(eSUBWAR!$I$21=\"Valid\",eMARKS!F30,eMARKS!G30*1.2)","v":0},{"$f":"IF(eSUBWAR!$I$21=\"Valid\",eMARKS!G30,eMARKS!H30*1.2)","v":0},{"$f":"IF(eSUBWAR!$I$21=\"Valid\",eMARKS!H30,eMARKS!#REF!*1.2)","v":0},null,null,null,null,{"$f":"IF(eSUBWAR!$I$21=\"Valid\",eMARKS!I30,eMARKS!J30*1.2)","v":0},{"$f":"IF(eSUBWAR!$I$21=\"Valid\",eMARKS!J30,eMARKS!K30*1.2)","v":0},{"$f":"IF(eSUBWAR!$I$21=\"Valid\",eMARKS!K30,eMARKS!L30*1.2)","v":0},{"$f":"IF(eSUBWAR!$I$21=\"Valid\",eMARKS!L30,eMARKS!M30*1.2)","v":0},{"$f":"IF(eSUBWAR!$I$21=\"Valid\",eMARKS!M30,eMARKS!N30*1.2)","v":0},{"$f":"IF(eSUBWAR!$I$21=\"Valid\",eMARKS!N30,eMARKS!#REF!*1.2)","v":0},null,null,null,null,{"$f":"IF(eSUBWAR!$I$21=\"Valid\",eMARKS!O30,eMARKS!P30*1.3)","v":0},{"$f":"IF(eSUBWAR!$I$21=\"Valid\",eMARKS!P30,eMARKS!Q30*1.3)","v":0},{"$f":"IF(eSUBWAR!$I$21=\"Valid\",eMARKS!Q30,eMARKS!R30*1.3)","v":0},{"$f":"IF(eSUBWAR!$I$21=\"Valid\",eMARKS!R30,eMARKS!S30*1.3)","v":0},{"$f":"IF(eSUBWAR!$I$21=\"Valid\",eMARKS!S30,eMARKS!T30*1.3)","v":0},{"$f":"IF(eSUBWAR!$I$21=\"Valid\",eMARKS!T30,eMARKS!#REF!*1.3)","v":0}]
[{"$f":"eSPAR!A30","v":0},{"$f":"eSPAR!B30","v":0},{"$f":"IF(eSUBWAR!$I$21=\"Valid\",eMARKS!C31,eMARKS!D31*1.2)","v":0},{"$f":"IF(eSUBWAR!$I$21=\"Valid\",eMARKS!D31,eMARKS!E31*1.2)","v":0},{"$f":"IF(eSUBWAR!$I$21=\"Valid\",eMARKS!E31,eMARKS!F31*1.2)","v":0},{"$f":"IF(eSUBWAR!$I$21=\"Valid\",eMARKS!F31,eMARKS!G31*1.2)","v":0},{"$f":"IF(eSUBWAR!$I$21=\"Valid\",eMARKS!G31,eMARKS!H31*1.2)","v":0},{"$f":"IF(eSUBWAR!$I$21=\"Valid\",eMARKS!H31,eMARKS!#REF!*1.2)","v":0},null,null,null,null,{"$f":"IF(eSUBWAR!$I$21=\"Valid\",eMARKS!I31,eMARKS!J31*1.2)","v":0},{"$f":"IF(eSUBWAR!$I$21=\"Valid\",eMARKS!J31,eMARKS!K31*1.2)","v":0},{"$f":"IF(eSUBWAR!$I$21=\"Valid\",eMARKS!K31,eMARKS!L31*1.2)","v":0},{"$f":"IF(eSUBWAR!$I$21=\"Valid\",eMARKS!L31,eMARKS!M31*1.2)","v":0},{"$f":"IF(eSUBWAR!$I$21=\"Valid\",eMARKS!M31,eMARKS!N31*1.2)","v":0},{"$f":"IF(eSUBWAR!$I$21=\"Valid\",eMARKS!N31,eMARKS!#REF!*1.2)","v":0},null,null,null,null,{"$f":"IF(eSUBWAR!$I$21=\"Valid\",eMARKS!O31,eMARKS!P31*1.3)","v":0},{"$f":"IF(eSUBWAR!$I$21=\"Valid\",eMARKS!P31,eMARKS!Q31*1.3)","v":0},{"$f":"IF(eSUBWAR!$I$21=\"Valid\",eMARKS!Q31,eMARKS!R31*1.3)","v":0},{"$f":"IF(eSUBWAR!$I$21=\"Valid\",eMARKS!R31,eMARKS!S31*1.3)","v":0},{"$f":"IF(eSUBWAR!$I$21=\"Valid\",eMARKS!S31,eMARKS!T31*1.3)","v":0},{"$f":"IF(eSUBWAR!$I$21=\"Valid\",eMARKS!T31,eMARKS!#REF!*1.3)","v":0}]
[{"$f":"eSPAR!A31","v":0},{"$f":"eSPAR!B31","v":0},{"$f":"IF(eSUBWAR!$I$21=\"Valid\",eMARKS!C32,eMARKS!D32*1.2)","v":0},{"$f":"IF(eSUBWAR!$I$21=\"Valid\",eMARKS!D32,eMARKS!E32*1.2)","v":0},{"$f":"IF(eSUBWAR!$I$21=\"Valid\",eMARKS!E32,eMARKS!F32*1.2)","v":0},{"$f":"IF(eSUBWAR!$I$21=\"Valid\",eMARKS!F32,eMARKS!G32*1.2)","v":0},{"$f":"IF(eSUBWAR!$I$21=\"Valid\",eMARKS!G32,eMARKS!H32*1.2)","v":0},{"$f":"IF(eSUBWAR!$I$21=\"Valid\",eMARKS!H32,eMARKS!#REF!*1.2)","v":0},null,null,null,null,{"$f":"IF(eSUBWAR!$I$21=\"Valid\",eMARKS!I32,eMARKS!J32*1.2)","v":0},{"$f":"IF(eSUBWAR!$I$21=\"Valid\",eMARKS!J32,eMARKS!K32*1.2)","v":0},{"$f":"IF(eSUBWAR!$I$21=\"Valid\",eMARKS!K32,eMARKS!L32*1.2)","v":0},{"$f":"IF(eSUBWAR!$I$21=\"Valid\",eMARKS!L32,eMARKS!M32*1.2)","v":0},{"$f":"IF(eSUBWAR!$I$21=\"Valid\",eMARKS!M32,eMARKS!N32*1.2)","v":0},{"$f":"IF(eSUBWAR!$I$21=\"Valid\",eMARKS!N32,eMARKS!#REF!*1.2)","v":0},null,null,null,null,{"$f":"IF(eSUBWAR!$I$21=\"Valid\",eMARKS!O32,eMARKS!P32*1.3)","v":0},{"$f":"IF(eSUBWAR!$I$21=\"Valid\",eMARKS!P32,eMARKS!Q32*1.3)","v":0},{"$f":"IF(eSUBWAR!$I$21=\"Valid\",eMARKS!Q32,eMARKS!R32*1.3)","v":0},{"$f":"IF(eSUBWAR!$I$21=\"Valid\",eMARKS!R32,eMARKS!S32*1.3)","v":0},{"$f":"IF(eSUBWAR!$I$21=\"Valid\",eMARKS!S32,eMARKS!T32*1.3)","v":0},{"$f":"IF(eSUBWAR!$I$21=\"Valid\",eMARKS!T32,eMARKS!#REF!*1.3)","v":0}]
[{"$f":"eSPAR!A32","v":0},{"$f":"eSPAR!B32","v":0},{"$f":"IF(eSUBWAR!$I$21=\"Valid\",eMARKS!C33,eMARKS!D33*1.2)","v":0},{"$f":"IF(eSUBWAR!$I$21=\"Valid\",eMARKS!D33,eMARKS!E33*1.2)","v":0},{"$f":"IF(eSUBWAR!$I$21=\"Valid\",eMARKS!E33,eMARKS!F33*1.2)","v":0},{"$f":"IF(eSUBWAR!$I$21=\"Valid\",eMARKS!F33,eMARKS!G33*1.2)","v":0},{"$f":"IF(eSUBWAR!$I$21=\"Valid\",eMARKS!G33,eMARKS!H33*1.2)","v":0},{"$f":"IF(eSUBWAR!$I$21=\"Valid\",eMARKS!H33,eMARKS!#REF!*1.2)","v":0},null,null,null,null,{"$f":"IF(eSUBWAR!$I$21=\"Valid\",eMARKS!I33,eMARKS!J33*1.2)","v":0},{"$f":"IF(eSUBWAR!$I$21=\"Valid\",eMARKS!J33,eMARKS!K33*1.2)","v":0},{"$f":"IF(eSUBWAR!$I$21=\"Valid\",eMARKS!K33,eMARKS!L33*1.2)","v":0},{"$f":"IF(eSUBWAR!$I$21=\"Valid\",eMARKS!L33,eMARKS!M33*1.2)","v":0},{"$f":"IF(eSUBWAR!$I$21=\"Valid\",eMARKS!M33,eMARKS!N33*1.2)","v":0},{"$f":"IF(eSUBWAR!$I$21=\"Valid\",eMARKS!N33,eMARKS!#REF!*1.2)","v":0},null,null,null,null,{"$f":"IF(eSUBWAR!$I$21=\"Valid\",eMARKS!O33,eMARKS!P33*1.3)","v":0},{"$f":"IF(eSUBWAR!$I$21=\"Valid\",eMARKS!P33,eMARKS!Q33*1.3)","v":0},{"$f":"IF(eSUBWAR!$I$21=\"Valid\",eMARKS!Q33,eMARKS!R33*1.3)","v":0},{"$f":"IF(eSUBWAR!$I$21=\"Valid\",eMARKS!R33,eMARKS!S33*1.3)","v":0},{"$f":"IF(eSUBWAR!$I$21=\"Valid\",eMARKS!S33,eMARKS!T33*1.3)","v":0},{"$f":"IF(eSUBWAR!$I$21=\"Valid\",eMARKS!T33,eMARKS!#REF!*1.3)","v":0}]
[{"$f":"eSPAR!A33","v":0},{"$f":"eSPAR!B33","v":0},{"$f":"IF(eSUBWAR!$I$21=\"Valid\",eMARKS!C34,eMARKS!D34*1.2)","v":0},{"$f":"IF(eSUBWAR!$I$21=\"Valid\",eMARKS!D34,eMARKS!E34*1.2)","v":0},{"$f":"IF(eSUBWAR!$I$21=\"Valid\",eMARKS!E34,eMARKS!F34*1.2)","v":0},{"$f":"IF(eSUBWAR!$I$21=\"Valid\",eMARKS!F34,eMARKS!G34*1.2)","v":0},{"$f":"IF(eSUBWAR!$I$21=\"Valid\",eMARKS!G34,eMARKS!H34*1.2)","v":0},{"$f":"IF(eSUBWAR!$I$21=\"Valid\",eMARKS!H34,eMARKS!#REF!*1.2)","v":0},null,null,null,null,{"$f":"IF(eSUBWAR!$I$21=\"Valid\",eMARKS!I34,eMARKS!J34*1.2)","v":0},{"$f":"IF(eSUBWAR!$I$21=\"Valid\",eMARKS!J34,eMARKS!K34*1.2)","v":0},{"$f":"IF(eSUBWAR!$I$21=\"Valid\",eMARKS!K34,eMARKS!L34*1.2)","v":0},{"$f":"IF(eSUBWAR!$I$21=\"Valid\",eMARKS!L34,eMARKS!M34*1.2)","v":0},{"$f":"IF(eSUBWAR!$I$21=\"Valid\",eMARKS!M34,eMARKS!N34*1.2)","v":0},{"$f":"IF(eSUBWAR!$I$21=\"Valid\",eMARKS!N34,eMARKS!#REF!*1.2)","v":0},null,null,null,null,{"$f":"IF(eSUBWAR!$I$21=\"Valid\",eMARKS!O34,eMARKS!P34*1.3)","v":0},{"$f":"IF(eSUBWAR!$I$21=\"Valid\",eMARKS!P34,eMARKS!Q34*1.3)","v":0},{"$f":"IF(eSUBWAR!$I$21=\"Valid\",eMARKS!Q34,eMARKS!R34*1.3)","v":0},{"$f":"IF(eSUBWAR!$I$21=\"Valid\",eMARKS!R34,eMARKS!S34*1.3)","v":0},{"$f":"IF(eSUBWAR!$I$21=\"Valid\",eMARKS!S34,eMARKS!T34*1.3)","v":0},{"$f":"IF(eSUBWAR!$I$21=\"Valid\",eMARKS!T34,eMARKS!#REF!*1.3)","v":0}]
[{"$f":"eSPAR!A34","v":0},{"$f":"eSPAR!B34","v":0},{"$f":"IF(eSUBWAR!$I$21=\"Valid\",eMARKS!C35,eMARKS!D35*1.2)","v":0},{"$f":"IF(eSUBWAR!$I$21=\"Valid\",eMARKS!D35,eMARKS!E35*1.2)","v":0},{"$f":"IF(eSUBWAR!$I$21=\"Valid\",eMARKS!E35,eMARKS!F35*1.2)","v":0},{"$f":"IF(eSUBWAR!$I$21=\"Valid\",eMARKS!F35,eMARKS!G35*1.2)","v":0},{"$f":"IF(eSUBWAR!$I$21=\"Valid\",eMARKS!G35,eMARKS!H35*1.2)","v":0},{"$f":"IF(eSUBWAR!$I$21=\"Valid\",eMARKS!H35,eMARKS!#REF!*1.2)","v":0},null,null,null,null,{"$f":"IF(eSUBWAR!$I$21=\"Valid\",eMARKS!I35,eMARKS!J35*1.2)","v":0},{"$f":"IF(eSUBWAR!$I$21=\"Valid\",eMARKS!J35,eMARKS!K35*1.2)","v":0},{"$f":"IF(eSUBWAR!$I$21=\"Valid\",eMARKS!K35,eMARKS!L35*1.2)","v":0},{"$f":"IF(eSUBWAR!$I$21=\"Valid\",eMARKS!L35,eMARKS!M35*1.2)","v":0},{"$f":"IF(eSUBWAR!$I$21=\"Valid\",eMARKS!M35,eMARKS!N35*1.2)","v":0},{"$f":"IF(eSUBWAR!$I$21=\"Valid\",eMARKS!N35,eMARKS!#REF!*1.2)","v":0},null,null,null,null,{"$f":"IF(eSUBWAR!$I$21=\"Valid\",eMARKS!O35,eMARKS!P35*1.3)","v":0},{"$f":"IF(eSUBWAR!$I$21=\"Valid\",eMARKS!P35,eMARKS!Q35*1.3)","v":0},{"$f":"IF(eSUBWAR!$I$21=\"Valid\",eMARKS!Q35,eMARKS!R35*1.3)","v":0},{"$f":"IF(eSUBWAR!$I$21=\"Valid\",eMARKS!R35,eMARKS!S35*1.3)","v":0},{"$f":"IF(eSUBWAR!$I$21=\"Valid\",eMARKS!S35,eMARKS!T35*1.3)","v":0},{"$f":"IF(eSUBWAR!$I$21=\"Valid\",eMARKS!T35,eMARKS!#REF!*1.3)","v":0}]
[{"$f":"eSPAR!A35","v":0},{"$f":"eSPAR!B35","v":0},{"$f":"IF(eSUBWAR!$I$21=\"Valid\",eMARKS!C36,eMARKS!D36*1.2)","v":0},{"$f":"IF(eSUBWAR!$I$21=\"Valid\",eMARKS!D36,eMARKS!E36*1.2)","v":0},{"$f":"IF(eSUBWAR!$I$21=\"Valid\",eMARKS!E36,eMARKS!F36*1.2)","v":0},{"$f":"IF(eSUBWAR!$I$21=\"Valid\",eMARKS!F36,eMARKS!G36*1.2)","v":0},{"$f":"IF(eSUBWAR!$I$21=\"Valid\",eMARKS!G36,eMARKS!H36*1.2)","v":0},{"$f":"IF(eSUBWAR!$I$21=\"Valid\",eMARKS!H36,eMARKS!#REF!*1.2)","v":0},null,null,null,null,{"$f":"IF(eSUBWAR!$I$21=\"Valid\",eMARKS!I36,eMARKS!J36*1.2)","v":0},{"$f":"IF(eSUBWAR!$I$21=\"Valid\",eMARKS!J36,eMARKS!K36*1.2)","v":0},{"$f":"IF(eSUBWAR!$I$21=\"Valid\",eMARKS!K36,eMARKS!L36*1.2)","v":0},{"$f":"IF(eSUBWAR!$I$21=\"Valid\",eMARKS!L36,eMARKS!M36*0.8)","v":0},{"$f":"IF(eSUBWAR!$I$21=\"Valid\",eMARKS!M36,eMARKS!N36*0.8)","v":0},{"$f":"IF(eSUBWAR!$I$21=\"Valid\",eMARKS!N36,eMARKS!#REF!*0.8)","v":0},null,null,null,null,{"$f":"IF(eSUBWAR!$I$21=\"Valid\",eMARKS!O36,eMARKS!P36*1.3)","v":0},{"$f":"IF(eSUBWAR!$I$21=\"Valid\",eMARKS!P36,eMARKS!Q36*1.3)","v":0},{"$f":"IF(eSUBWAR!$I$21=\"Valid\",eMARKS!Q36,eMARKS!R36*1.3)","v":0},{"$f":"IF(eSUBWAR!$I$21=\"Valid\",eMARKS!R36,eMARKS!S36*1.3)","v":0},{"$f":"IF(eSUBWAR!$I$21=\"Valid\",eMARKS!S36,eMARKS!T36*1.3)","v":0},{"$f":"IF(eSUBWAR!$I$21=\"Valid\",eMARKS!T36,eMARKS!#REF!*1.3)","v":0}]
[{"$f":"eSPAR!A36","v":0},{"$f":"eSPAR!B36","v":0},{"$f":"IF(eSUBWAR!$I$21=\"Valid\",eMARKS!C37,eMARKS!D37*1.2)","v":0},{"$f":"IF(eSUBWAR!$I$21=\"Valid\",eMARKS!D37,eMARKS!E37*1.2)","v":0},{"$f":"IF(eSUBWAR!$I$21=\"Valid\",eMARKS!E37,eMARKS!F37*1.2)","v":0},{"$f":"IF(eSUBWAR!$I$21=\"Valid\",eMARKS!F37,eMARKS!G37*1.2)","v":0},{"$f":"IF(eSUBWAR!$I$21=\"Valid\",eMARKS!G37,eMARKS!H37*1.2)","v":0},{"$f":"IF(eSUBWAR!$I$21=\"Valid\",eMARKS!H37,eMARKS!#REF!*1.2)","v":0},null,null,null,null,{"$f":"IF(eSUBWAR!$I$21=\"Valid\",eMARKS!I37,eMARKS!J37*1.2)","v":0},{"$f":"IF(eSUBWAR!$I$21=\"Valid\",eMARKS!J37,eMARKS!K37*1.2)","v":0},{"$f":"IF(eSUBWAR!$I$21=\"Valid\",eMARKS!K37,eMARKS!L37*1.2)","v":0},{"$f":"IF(eSUBWAR!$I$21=\"Valid\",eMARKS!L37,eMARKS!M37*0.8)","v":0},{"$f":"IF(eSUBWAR!$I$21=\"Valid\",eMARKS!M37,eMARKS!N37*0.8)","v":0},{"$f":"IF(eSUBWAR!$I$21=\"Valid\",eMARKS!N37,eMARKS!#REF!*0.8)","v":0},null,null,null,null,{"$f":"IF(eSUBWAR!$I$21=\"Valid\",eMARKS!O37,eMARKS!P37*1.2)","v":0},{"$f":"IF(eSUBWAR!$I$21=\"Valid\",eMARKS!P37,eMARKS!Q37*1.2)","v":0},{"$f":"IF(eSUBWAR!$I$21=\"Valid\",eMARKS!Q37,eMARKS!R37*1.2)","v":0},{"$f":"IF(eSUBWAR!$I$21=\"Valid\",eMARKS!R37,eMARKS!S37*1.2)","v":0},{"$f":"IF(eSUBWAR!$I$21=\"Valid\",eMARKS!S37,eMARKS!T37*1.2)","v":0},{"$f":"IF(eSUBWAR!$I$21=\"Valid\",eMARKS!T37,eMARKS!#REF!*1.2)","v":0}]
[{"$f":"eSPAR!A37","v":0},{"$f":"eSPAR!B37","v":0},{"$f":"IF(eSUBWAR!$I$21=\"Valid\",eMARKS!C38,eMARKS!D38*1.2)","v":0},{"$f":"IF(eSUBWAR!$I$21=\"Valid\",eMARKS!D38,eMARKS!E38*1.2)","v":0},{"$f":"IF(eSUBWAR!$I$21=\"Valid\",eMARKS!E38,eMARKS!F38*1.2)","v":0},{"$f":"IF(eSUBWAR!$I$21=\"Valid\",eMARKS!F38,eMARKS!G38*1.2)","v":0},{"$f":"IF(eSUBWAR!$I$21=\"Valid\",eMARKS!G38,eMARKS!H38*1.2)","v":0},{"$f":"IF(eSUBWAR!$I$21=\"Valid\",eMARKS!H38,eMARKS!#REF!*1.2)","v":0},null,null,null,null,{"$f":"IF(eSUBWAR!$I$21=\"Valid\",eMARKS!I38,eMARKS!J38*1.2)","v":0},{"$f":"IF(eSUBWAR!$I$21=\"Valid\",eMARKS!J38,eMARKS!K38*1.7)","v":0},{"$f":"IF(eSUBWAR!$I$21=\"Valid\",eMARKS!K38,eMARKS!L38*1.7)","v":0},{"$f":"IF(eSUBWAR!$I$21=\"Valid\",eMARKS!L38,eMARKS!M38*0.8)","v":0},{"$f":"IF(eSUBWAR!$I$21=\"Valid\",eMARKS!M38,eMARKS!N38*0.8)","v":0},{"$f":"IF(eSUBWAR!$I$21=\"Valid\",eMARKS!N38,eMARKS!#REF!*0.8)","v":0},null,null,null,null,{"$f":"IF(eSUBWAR!$I$21=\"Valid\",eMARKS!O38,eMARKS!P38*1.7)","v":0},{"$f":"IF(eSUBWAR!$I$21=\"Valid\",eMARKS!P38,eMARKS!Q38*1.7)","v":0},{"$f":"IF(eSUBWAR!$I$21=\"Valid\",eMARKS!Q38,eMARKS!R38*1.7)","v":0},{"$f":"IF(eSUBWAR!$I$21=\"Valid\",eMARKS!R38,eMARKS!S38*1.2)","v":0},{"$f":"IF(eSUBWAR!$I$21=\"Valid\",eMARKS!S38,eMARKS!T38*1.2)","v":0},{"$f":"IF(eSUBWAR!$I$21=\"Valid\",eMARKS!T38,eMARKS!#REF!*1.2)","v":0}]
[{"$f":"eSPAR!A38","v":0},{"$f":"eSPAR!B38","v":0},{"$f":"IF(eSUBWAR!$I$21=\"Valid\",eMARKS!C39,eMARKS!D39*1.2)","v":0},{"$f":"IF(eSUBWAR!$I$21=\"Valid\",eMARKS!D39,eMARKS!E39*1.2)","v":0},{"$f":"IF(eSUBWAR!$I$21=\"Valid\",eMARKS!E39,eMARKS!F39*1.2)","v":0},{"$f":"IF(eSUBWAR!$I$21=\"Valid\",eMARKS!F39,eMARKS!G39*1.2)","v":0},{"$f":"IF(eSUBWAR!$I$21=\"Valid\",eMARKS!G39,eMARKS!H39*1.2)","v":0},{"$f":"IF(eSUBWAR!$I$21=\"Valid\",eMARKS!H39,eMARKS!#REF!*1.2)","v":0},null,null,null,null,{"$f":"IF(eSUBWAR!$I$21=\"Valid\",eMARKS!I39,eMARKS!J39*1.2)","v":0},{"$f":"IF(eSUBWAR!$I$21=\"Valid\",eMARKS!J39,eMARKS!K39*1.7)","v":0},{"$f":"IF(eSUBWAR!$I$21=\"Valid\",eMARKS!K39,eMARKS!L39*1.7)","v":0},{"$f":"IF(eSUBWAR!$I$21=\"Valid\",eMARKS!L39,eMARKS!M39*0.8)","v":0},{"$f":"IF(eSUBWAR!$I$21=\"Valid\",eMARKS!M39,eMARKS!N39*0.8)","v":0},{"$f":"IF(eSUBWAR!$I$21=\"Valid\",eMARKS!N39,eMARKS!#REF!*0.8)","v":0},null,null,null,null,{"$f":"IF(eSUBWAR!$I$21=\"Valid\",eMARKS!O39,eMARKS!P39*1.7)","v":0},{"$f":"IF(eSUBWAR!$I$21=\"Valid\",eMARKS!P39,eMARKS!Q39*1.7)","v":0},{"$f":"IF(eSUBWAR!$I$21=\"Valid\",eMARKS!Q39,eMARKS!R39*1.7)","v":0},{"$f":"IF(eSUBWAR!$I$21=\"Valid\",eMARKS!R39,eMARKS!S39*1.2)","v":0},{"$f":"IF(eSUBWAR!$I$21=\"Valid\",eMARKS!S39,eMARKS!T39*1.2)","v":0},{"$f":"IF(eSUBWAR!$I$21=\"Valid\",eMARKS!T39,eMARKS!#REF!*1.2)","v":0}]
[{"$f":"eSPAR!A39","v":0},{"$f":"eSPAR!B39","v":0},{"$f":"IF(eSUBWAR!$I$21=\"Valid\",eMARKS!C40,eMARKS!D40*1.2)","v":0},{"$f":"IF(eSUBWAR!$I$21=\"Valid\",eMARKS!D40,eMARKS!E40*1.2)","v":0},{"$f":"IF(eSUBWAR!$I$21=\"Valid\",eMARKS!E40,eMARKS!F40*1.2)","v":0},{"$f":"IF(eSUBWAR!$I$21=\"Valid\",eMARKS!F40,eMARKS!G40*1.2)","v":0},{"$f":"IF(eSUBWAR!$I$21=\"Valid\",eMARKS!G40,eMARKS!H40*1.2)","v":0},{"$f":"IF(eSUBWAR!$I$21=\"Valid\",eMARKS!H40,eMARKS!#REF!*1.2)","v":0},null,null,null,null,{"$f":"IF(eSUBWAR!$I$21=\"Valid\",eMARKS!I40,eMARKS!J40*1.2)","v":0},{"$f":"IF(eSUBWAR!$I$21=\"Valid\",eMARKS!J40,eMARKS!K40*1.7)","v":0},{"$f":"IF(eSUBWAR!$I$21=\"Valid\",eMARKS!K40,eMARKS!L40*1.7)","v":0},{"$f":"IF(eSUBWAR!$I$21=\"Valid\",eMARKS!L40,eMARKS!M40*0.8)","v":0},{"$f":"IF(eSUBWAR!$I$21=\"Valid\",eMARKS!M40,eMARKS!N40*0.8)","v":0},{"$f":"IF(eSUBWAR!$I$21=\"Valid\",eMARKS!N40,eMARKS!#REF!*0.8)","v":0},null,null,null,null,{"$f":"IF(eSUBWAR!$I$21=\"Valid\",eMARKS!O40,eMARKS!P40*1.7)","v":0},{"$f":"IF(eSUBWAR!$I$21=\"Valid\",eMARKS!P40,eMARKS!Q40*1.7)","v":0},{"$f":"IF(eSUBWAR!$I$21=\"Valid\",eMARKS!Q40,eMARKS!R40*1.7)","v":0},{"$f":"IF(eSUBWAR!$I$21=\"Valid\",eMARKS!R40,eMARKS!S40*1.2)","v":0},{"$f":"IF(eSUBWAR!$I$21=\"Valid\",eMARKS!S40,eMARKS!T40*1.2)","v":0},{"$f":"IF(eSUBWAR!$I$21=\"Valid\",eMARKS!T40,eMARKS!#REF!*1.2)","v":0}]
[{"$f":"eSPAR!A40","v":0},{"$f":"eSPAR!B40","v":0},{"$f":"IF(eSUBWAR!$I$21=\"Valid\",eMARKS!C41,eMARKS!D41*1.2)","v":0},{"$f":"IF(eSUBWAR!$I$21=\"Valid\",eMARKS!D41,eMARKS!E41*1.2)","v":0},{"$f":"IF(eSUBWAR!$I$21=\"Valid\",eMARKS!E41,eMARKS!F41*1.2)","v":0},{"$f":"IF(eSUBWAR!$I$21=\"Valid\",eMARKS!F41,eMARKS!G41*1.2)","v":0},{"$f":"IF(eSUBWAR!$I$21=\"Valid\",eMARKS!G41,eMARKS!H41*1.2)","v":0},{"$f":"IF(eSUBWAR!$I$21=\"Valid\",eMARKS!H41,eMARKS!#REF!*1.2)","v":0},null,null,null,null,{"$f":"IF(eSUBWAR!$I$21=\"Valid\",eMARKS!I41,eMARKS!J41*1.2)","v":0},{"$f":"IF(eSUBWAR!$I$21=\"Valid\",eMARKS!J41,eMARKS!K41*1.2)","v":0},{"$f":"IF(eSUBWAR!$I$21=\"Valid\",eMARKS!K41,eMARKS!L41*1.2)","v":0},{"$f":"IF(eSUBWAR!$I$21=\"Valid\",eMARKS!L41,eMARKS!M41*0.8)","v":0},{"$f":"IF(eSUBWAR!$I$21=\"Valid\",eMARKS!M41,eMARKS!N41*0.8)","v":0},{"$f":"IF(eSUBWAR!$I$21=\"Valid\",eMARKS!N41,eMARKS!#REF!*0.8)","v":0},null,null,null,null,{"$f":"IF(eSUBWAR!$I$21=\"Valid\",eMARKS!O41,eMARKS!P41*1.2)","v":0},{"$f":"IF(eSUBWAR!$I$21=\"Valid\",eMARKS!P41,eMARKS!Q41*1.2)","v":0},{"$f":"IF(eSUBWAR!$I$21=\"Valid\",eMARKS!Q41,eMARKS!R41*1.2)","v":0},{"$f":"IF(eSUBWAR!$I$21=\"Valid\",eMARKS!R41,eMARKS!S41*1.2)","v":0},{"$f":"IF(eSUBWAR!$I$21=\"Valid\",eMARKS!S41,eMARKS!T41*1.2)","v":0},{"$f":"IF(eSUBWAR!$I$21=\"Valid\",eMARKS!T41,eMARKS!#REF!*1.2)","v":0}]
[{"$f":"eSPAR!A41","v":0},{"$f":"eSPAR!B41","v":0},{"$f":"IF(eSUBWAR!$I$21=\"Valid\",eMARKS!C42,eMARKS!D42*1.2)","v":0},{"$f":"IF(eSUBWAR!$I$21=\"Valid\",eMARKS!D42,eMARKS!E42*1.2)","v":0},{"$f":"IF(eSUBWAR!$I$21=\"Valid\",eMARKS!E42,eMARKS!F42*1.2)","v":0},{"$f":"IF(eSUBWAR!$I$21=\"Valid\",eMARKS!F42,eMARKS!G42*1.2)","v":0},{"$f":"IF(eSUBWAR!$I$21=\"Valid\",eMARKS!G42,eMARKS!H42*1.2)","v":0},{"$f":"IF(eSUBWAR!$I$21=\"Valid\",eMARKS!H42,eMARKS!#REF!*1.2)","v":0},null,null,null,null,{"$f":"IF(eSUBWAR!$I$21=\"Valid\",eMARKS!I42,eMARKS!J42*1.2)","v":0},{"$f":"IF(eSUBWAR!$I$21=\"Valid\",eMARKS!J42,eMARKS!K42*1.2)","v":0},{"$f":"IF(eSUBWAR!$I$21=\"Valid\",eMARKS!K42,eMARKS!L42*1.2)","v":0},{"$f":"IF(eSUBWAR!$I$21=\"Valid\",eMARKS!L42,eMARKS!M42*1.2)","v":0},{"$f":"IF(eSUBWAR!$I$21=\"Valid\",eMARKS!M42,eMARKS!N42*1.2)","v":0},{"$f":"IF(eSUBWAR!$I$21=\"Valid\",eMARKS!N42,eMARKS!#REF!*1.2)","v":0},null,null,null,null,{"$f":"IF(eSUBWAR!$I$21=\"Valid\",eMARKS!O42,eMARKS!P42*1.2)","v":0},{"$f":"IF(eSUBWAR!$I$21=\"Valid\",eMARKS!P42,eMARKS!Q42*1.2)","v":0},{"$f":"IF(eSUBWAR!$I$21=\"Valid\",eMARKS!Q42,eMARKS!R42*1.2)","v":0},{"$f":"IF(eSUBWAR!$I$21=\"Valid\",eMARKS!R42,eMARKS!S42*1.2)","v":0},{"$f":"IF(eSUBWAR!$I$21=\"Valid\",eMARKS!S42,eMARKS!T42*1.2)","v":0},{"$f":"IF(eSUBWAR!$I$21=\"Valid\",eMARKS!T42,eMARKS!#REF!*1.2)","v":0}]
[{"$f":"eSPAR!A42","v":0},{"$f":"eSPAR!B42","v":0},{"$f":"IF(eSUBWAR!$I$21=\"Valid\",eMARKS!C43,eMARKS!D43*1.2)","v":0},{"$f":"IF(eSUBWAR!$I$21=\"Valid\",eMARKS!D43,eMARKS!E43*1.2)","v":0},{"$f":"IF(eSUBWAR!$I$21=\"Valid\",eMARKS!E43,eMARKS!F43*1.2)","v":0},{"$f":"IF(eSUBWAR!$I$21=\"Valid\",eMARKS!F43,eMARKS!G43*1.2)","v":0},{"$f":"IF(eSUBWAR!$I$21=\"Valid\",eMARKS!G43,eMARKS!H43*1.2)","v":0},{"$f":"IF(eSUBWAR!$I$21=\"Valid\",eMARKS!H43,eMARKS!#REF!*1.2)","v":0},null,null,null,null,{"$f":"IF(eSUBWAR!$I$21=\"Valid\",eMARKS!I43,eMARKS!J43*1.2)","v":0},{"$f":"IF(eSUBWAR!$I$21=\"Valid\",eMARKS!J43,eMARKS!K43*1.2)","v":0},{"$f":"IF(eSUBWAR!$I$21=\"Valid\",eMARKS!K43,eMARKS!L43*1.2)","v":0},{"$f":"IF(eSUBWAR!$I$21=\"Valid\",eMARKS!L43,eMARKS!M43*1.2)","v":0},{"$f":"IF(eSUBWAR!$I$21=\"Valid\",eMARKS!M43,eMARKS!N43*1.2)","v":0},{"$f":"IF(eSUBWAR!$I$21=\"Valid\",eMARKS!N43,eMARKS!#REF!*1.2)","v":0},null,null,null,null,{"$f":"IF(eSUBWAR!$I$21=\"Valid\",eMARKS!O43,eMARKS!P43*1.2)","v":0},{"$f":"IF(eSUBWAR!$I$21=\"Valid\",eMARKS!P43,eMARKS!Q43*1.2)","v":0},{"$f":"IF(eSUBWAR!$I$21=\"Valid\",eMARKS!Q43,eMARKS!R43*1.2)","v":0},{"$f":"IF(eSUBWAR!$I$21=\"Valid\",eMARKS!R43,eMARKS!S43*1.2)","v":0},{"$f":"IF(eSUBWAR!$I$21=\"Valid\",eMARKS!S43,eMARKS!T43*1.2)","v":0},{"$f":"IF(eSUBWAR!$I$21=\"Valid\",eMARKS!T43,eMARKS!#REF!*1.2)","v":0}]
[{"$f":"eSPAR!A43","v":0},{"$f":"eSPAR!B43","v":0},{"$f":"IF(eSUBWAR!$I$21=\"Valid\",eMARKS!C44,eMARKS!D44*1.2)","v":0},{"$f":"IF(eSUBWAR!$I$21=\"Valid\",eMARKS!D44,eMARKS!E44*1.2)","v":0},{"$f":"IF(eSUBWAR!$I$21=\"Valid\",eMARKS!E44,eMARKS!F44*1.2)","v":0},{"$f":"IF(eSUBWAR!$I$21=\"Valid\",eMARKS!F44,eMARKS!G44*1.2)","v":0},{"$f":"IF(eSUBWAR!$I$21=\"Valid\",eMARKS!G44,eMARKS!H44*1.2)","v":0},{"$f":"IF(eSUBWAR!$I$21=\"Valid\",eMARKS!H44,eMARKS!#REF!*1.2)","v":0},null,null,null,null,{"$f":"IF(eSUBWAR!$I$21=\"Valid\",eMARKS!I44,eMARKS!J44*1.2)","v":0},{"$f":"IF(eSUBWAR!$I$21=\"Valid\",eMARKS!J44,eMARKS!K44*1.2)","v":0},{"$f":"IF(eSUBWAR!$I$21=\"Valid\",eMARKS!K44,eMARKS!L44*1.2)","v":0},{"$f":"IF(eSUBWAR!$I$21=\"Valid\",eMARKS!L44,eMARKS!M44*1.2)","v":0},{"$f":"IF(eSUBWAR!$I$21=\"Valid\",eMARKS!M44,eMARKS!N44*1.2)","v":0},{"$f":"IF(eSUBWAR!$I$21=\"Valid\",eMARKS!N44,eMARKS!#REF!*1.2)","v":0},null,null,null,null,{"$f":"IF(eSUBWAR!$I$21=\"Valid\",eMARKS!O44,eMARKS!P44*1.2)","v":0},{"$f":"IF(eSUBWAR!$I$21=\"Valid\",eMARKS!P44,eMARKS!Q44*1.2)","v":0},{"$f":"IF(eSUBWAR!$I$21=\"Valid\",eMARKS!Q44,eMARKS!R44*1.2)","v":0},{"$f":"IF(eSUBWAR!$I$21=\"Valid\",eMARKS!R44,eMARKS!S44*1.2)","v":0},{"$f":"IF(eSUBWAR!$I$21=\"Valid\",eMARKS!S44,eMARKS!T44*1.2)","v":0},{"$f":"IF(eSUBWAR!$I$21=\"Valid\",eMARKS!T44,eMARKS!#REF!*1.2)","v":0}]
[{"$f":"eSPAR!A44","v":0},{"$f":"eSPAR!B44","v":0},{"$f":"IF(eSUBWAR!$I$21=\"Valid\",eMARKS!C45,eMARKS!D45*1.2)","v":0},{"$f":"IF(eSUBWAR!$I$21=\"Valid\",eMARKS!D45,eMARKS!E45*1.2)","v":0},{"$f":"IF(eSUBWAR!$I$21=\"Valid\",eMARKS!E45,eMARKS!F45*1.2)","v":0},{"$f":"IF(eSUBWAR!$I$21=\"Valid\",eMARKS!F45,eMARKS!G45*1.2)","v":0},{"$f":"IF(eSUBWAR!$I$21=\"Valid\",eMARKS!G45,eMARKS!H45*1.2)","v":0},{"$f":"IF(eSUBWAR!$I$21=\"Valid\",eMARKS!H45,eMARKS!#REF!*1.2)","v":0},null,null,null,null,{"$f":"IF(eSUBWAR!$I$21=\"Valid\",eMARKS!I45,eMARKS!J45*1.2)","v":0},{"$f":"IF(eSUBWAR!$I$21=\"Valid\",eMARKS!J45,eMARKS!K45*1.2)","v":0},{"$f":"IF(eSUBWAR!$I$21=\"Valid\",eMARKS!K45,eMARKS!L45*1.2)","v":0},{"$f":"IF(eSUBWAR!$I$21=\"Valid\",eMARKS!L45,eMARKS!M45*1.2)","v":0},{"$f":"IF(eSUBWAR!$I$21=\"Valid\",eMARKS!M45,eMARKS!N45*1.2)","v":0},{"$f":"IF(eSUBWAR!$I$21=\"Valid\",eMARKS!N45,eMARKS!#REF!*1.2)","v":0},null,null,null,null,{"$f":"IF(eSUBWAR!$I$21=\"Valid\",eMARKS!O45,eMARKS!P45*1.2)","v":0},{"$f":"IF(eSUBWAR!$I$21=\"Valid\",eMARKS!P45,eMARKS!Q45*1.2)","v":0},{"$f":"IF(eSUBWAR!$I$21=\"Valid\",eMARKS!Q45,eMARKS!R45*1.2)","v":0},{"$f":"IF(eSUBWAR!$I$21=\"Valid\",eMARKS!R45,eMARKS!S45*1.2)","v":0},{"$f":"IF(eSUBWAR!$I$21=\"Valid\",eMARKS!S45,eMARKS!T45*1.2)","v":0},{"$f":"IF(eSUBWAR!$I$21=\"Valid\",eMARKS!T45,eMARKS!#REF!*1.2)","v":0}]
[{"$f":"eSPAR!A45","v":0},{"$f":"eSPAR!B45","v":0},{"$f":"IF(eSUBWAR!$I$21=\"Valid\",eMARKS!C46,eMARKS!D46*1.2)","v":0},{"$f":"IF(eSUBWAR!$I$21=\"Valid\",eMARKS!D46,eMARKS!E46*1.2)","v":0},{"$f":"IF(eSUBWAR!$I$21=\"Valid\",eMARKS!E46,eMARKS!F46*1.2)","v":0},{"$f":"IF(eSUBWAR!$I$21=\"Valid\",eMARKS!F46,eMARKS!G46*1.2)","v":0},{"$f":"IF(eSUBWAR!$I$21=\"Valid\",eMARKS!G46,eMARKS!H46*1.2)","v":0},{"$f":"IF(eSUBWAR!$I$21=\"Valid\",eMARKS!H46,eMARKS!#REF!*1.2)","v":0},null,null,null,null,{"$f":"IF(eSUBWAR!$I$21=\"Valid\",eMARKS!I46,eMARKS!J46*1.2)","v":0},{"$f":"IF(eSUBWAR!$I$21=\"Valid\",eMARKS!J46,eMARKS!K46*1.2)","v":0},{"$f":"IF(eSUBWAR!$I$21=\"Valid\",eMARKS!K46,eMARKS!L46*1.2)","v":0},{"$f":"IF(eSUBWAR!$I$21=\"Valid\",eMARKS!L46,eMARKS!M46*1.2)","v":0},{"$f":"IF(eSUBWAR!$I$21=\"Valid\",eMARKS!M46,eMARKS!N46*1.2)","v":0},{"$f":"IF(eSUBWAR!$I$21=\"Valid\",eMARKS!N46,eMARKS!#REF!*1.2)","v":0},null,null,null,null,{"$f":"IF(eSUBWAR!$I$21=\"Valid\",eMARKS!O46,eMARKS!P46*1.2)","v":0},{"$f":"IF(eSUBWAR!$I$21=\"Valid\",eMARKS!P46,eMARKS!Q46*1.2)","v":0},{"$f":"IF(eSUBWAR!$I$21=\"Valid\",eMARKS!Q46,eMARKS!R46*1.2)","v":0},{"$f":"IF(eSUBWAR!$I$21=\"Valid\",eMARKS!R46,eMARKS!S46*1.2)","v":0},{"$f":"IF(eSUBWAR!$I$21=\"Valid\",eMARKS!S46,eMARKS!T46*1.2)","v":0},{"$f":"IF(eSUBWAR!$I$21=\"Valid\",eMARKS!T46,eMARKS!#REF!*1.2)","v":0}]
[{"$f":"eSPAR!A46","v":0},{"$f":"eSPAR!B46","v":0},{"$f":"IF(eSUBWAR!$I$21=\"Valid\",eMARKS!C47,eMARKS!D47*1.7)","v":0},{"$f":"IF(eSUBWAR!$I$21=\"Valid\",eMARKS!D47,eMARKS!E47*1.7)","v":0},{"$f":"IF(eSUBWAR!$I$21=\"Valid\",eMARKS!E47,eMARKS!F47*1.7)","v":0},{"$f":"IF(eSUBWAR!$I$21=\"Valid\",eMARKS!F47,eMARKS!G47*1.7)","v":0},{"$f":"IF(eSUBWAR!$I$21=\"Valid\",eMARKS!G47,eMARKS!H47*1.7)","v":0},{"$f":"IF(eSUBWAR!$I$21=\"Valid\",eMARKS!H47,eMARKS!#REF!*1.7)","v":0},null,null,null,null,{"$f":"IF(eSUBWAR!$I$21=\"Valid\",eMARKS!I47,eMARKS!J47*1.2)","v":0},{"$f":"IF(eSUBWAR!$I$21=\"Valid\",eMARKS!J47,eMARKS!K47*1.2)","v":0},{"$f":"IF(eSUBWAR!$I$21=\"Valid\",eMARKS!K47,eMARKS!L47*1.2)","v":0},{"$f":"IF(eSUBWAR!$I$21=\"Valid\",eMARKS!L47,eMARKS!M47*1.2)","v":0},{"$f":"IF(eSUBWAR!$I$21=\"Valid\",eMARKS!M47,eMARKS!N47*1.2)","v":0},{"$f":"IF(eSUBWAR!$I$21=\"Valid\",eMARKS!N47,eMARKS!#REF!*1.2)","v":0},null,null,null,null,{"$f":"IF(eSUBWAR!$I$21=\"Valid\",eMARKS!O47,eMARKS!P47*1.2)","v":0},{"$f":"IF(eSUBWAR!$I$21=\"Valid\",eMARKS!P47,eMARKS!Q47*1.2)","v":0},{"$f":"IF(eSUBWAR!$I$21=\"Valid\",eMARKS!Q47,eMARKS!R47*1.2)","v":0},{"$f":"IF(eSUBWAR!$I$21=\"Valid\",eMARKS!R47,eMARKS!S47*1.2)","v":0},{"$f":"IF(eSUBWAR!$I$21=\"Valid\",eMARKS!S47,eMARKS!T47*1.2)","v":0},{"$f":"IF(eSUBWAR!$I$21=\"Valid\",eMARKS!T47,eMARKS!#REF!*1.2)","v":0}]
[{"$f":"eSPAR!A47","v":0},{"$f":"eSPAR!B47","v":0},{"$f":"IF(eSUBWAR!$I$21=\"Valid\",eMARKS!C48,eMARKS!D48*1.7)","v":0},{"$f":"IF(eSUBWAR!$I$21=\"Valid\",eMARKS!D48,eMARKS!E48*1.7)","v":0},{"$f":"IF(eSUBWAR!$I$21=\"Valid\",eMARKS!E48,eMARKS!F48*1.7)","v":0},{"$f":"IF(eSUBWAR!$I$21=\"Valid\",eMARKS!F48,eMARKS!G48*1.7)","v":0},{"$f":"IF(eSUBWAR!$I$21=\"Valid\",eMARKS!G48,eMARKS!H48*1.7)","v":0},{"$f":"IF(eSUBWAR!$I$21=\"Valid\",eMARKS!H48,eMARKS!#REF!*1.7)","v":0},null,null,null,null,{"$f":"IF(eSUBWAR!$I$21=\"Valid\",eMARKS!I48,eMARKS!J48*1.2)","v":0},{"$f":"IF(eSUBWAR!$I$21=\"Valid\",eMARKS!J48,eMARKS!K48*1.2)","v":0},{"$f":"IF(eSUBWAR!$I$21=\"Valid\",eMARKS!K48,eMARKS!L48*1.2)","v":0},{"$f":"IF(eSUBWAR!$I$21=\"Valid\",eMARKS!L48,eMARKS!M48*1.2)","v":0},{"$f":"IF(eSUBWAR!$I$21=\"Valid\",eMARKS!M48,eMARKS!N48*1.2)","v":0},{"$f":"IF(eSUBWAR!$I$21=\"Valid\",eMARKS!N48,eMARKS!#REF!*1.2)","v":0},null,null,null,null,{"$f":"IF(eSUBWAR!$I$21=\"Valid\",eMARKS!O48,eMARKS!P48*0.8)","v":0},{"$f":"IF(eSUBWAR!$I$21=\"Valid\",eMARKS!P48,eMARKS!Q48*0.8)","v":0},{"$f":"IF(eSUBWAR!$I$21=\"Valid\",eMARKS!Q48,eMARKS!R48*0.8)","v":0},{"$f":"IF(eSUBWAR!$I$21=\"Valid\",eMARKS!R48,eMARKS!S48*0.8)","v":0},{"$f":"IF(eSUBWAR!$I$21=\"Valid\",eMARKS!S48,eMARKS!T48*0.8)","v":0},{"$f":"IF(eSUBWAR!$I$21=\"Valid\",eMARKS!T48,eMARKS!#REF!*1.2)","v":0}]
[{"$f":"eSPAR!A48","v":0},{"$f":"eSPAR!B48","v":0},{"$f":"IF(eSUBWAR!$I$21=\"Valid\",eMARKS!C49,eMARKS!D49*1.7)","v":0},{"$f":"IF(eSUBWAR!$I$21=\"Valid\",eMARKS!D49,eMARKS!E49*1.7)","v":0},{"$f":"IF(eSUBWAR!$I$21=\"Valid\",eMARKS!E49,eMARKS!F49*1.7)","v":0},{"$f":"IF(eSUBWAR!$I$21=\"Valid\",eMARKS!F49,eMARKS!G49*1.7)","v":0},{"$f":"IF(eSUBWAR!$I$21=\"Valid\",eMARKS!G49,eMARKS!H49*1.7)","v":0},{"$f":"IF(eSUBWAR!$I$21=\"Valid\",eMARKS!H49,eMARKS!#REF!*1.7)","v":0},null,null,null,null,{"$f":"IF(eSUBWAR!$I$21=\"Valid\",eMARKS!I49,eMARKS!J49*1.2)","v":0},{"$f":"IF(eSUBWAR!$I$21=\"Valid\",eMARKS!J49,eMARKS!K49*1.2)","v":0},{"$f":"IF(eSUBWAR!$I$21=\"Valid\",eMARKS!K49,eMARKS!L49*1.2)","v":0},{"$f":"IF(eSUBWAR!$I$21=\"Valid\",eMARKS!L49,eMARKS!M49*1.2)","v":0},{"$f":"IF(eSUBWAR!$I$21=\"Valid\",eMARKS!M49,eMARKS!N49*1.2)","v":0},{"$f":"IF(eSUBWAR!$I$21=\"Valid\",eMARKS!N49,eMARKS!#REF!*1.2)","v":0},null,null,null,null,{"$f":"IF(eSUBWAR!$I$21=\"Valid\",eMARKS!O49,eMARKS!P49*0.8)","v":0},{"$f":"IF(eSUBWAR!$I$21=\"Valid\",eMARKS!P49,eMARKS!Q49*0.8)","v":0},{"$f":"IF(eSUBWAR!$I$21=\"Valid\",eMARKS!Q49,eMARKS!R49*0.8)","v":0},{"$f":"IF(eSUBWAR!$I$21=\"Valid\",eMARKS!R49,eMARKS!S49*0.8)","v":0},{"$f":"IF(eSUBWAR!$I$21=\"Valid\",eMARKS!S49,eMARKS!T49*0.8)","v":0},{"$f":"IF(eSUBWAR!$I$21=\"Valid\",eMARKS!T49,eMARKS!#REF!*1.2)","v":0}]
[{"$f":"eSPAR!A49","v":0},{"$f":"eSPAR!B49","v":0},{"$f":"IF(eSUBWAR!$I$21=\"Valid\",eMARKS!C50,eMARKS!D50*1.7)","v":0},{"$f":"IF(eSUBWAR!$I$21=\"Valid\",eMARKS!D50,eMARKS!E50*1.7)","v":0},{"$f":"IF(eSUBWAR!$I$21=\"Valid\",eMARKS!E50,eMARKS!F50*1.7)","v":0},{"$f":"IF(eSUBWAR!$I$21=\"Valid\",eMARKS!F50,eMARKS!G50*1.7)","v":0},{"$f":"IF(eSUBWAR!$I$21=\"Valid\",eMARKS!G50,eMARKS!H50*1.7)","v":0},{"$f":"IF(eSUBWAR!$I$21=\"Valid\",eMARKS!H50,eMARKS!#REF!*1.7)","v":0},null,null,null,null,{"$f":"IF(eSUBWAR!$I$21=\"Valid\",eMARKS!I50,eMARKS!J50*1.2)","v":0},{"$f":"IF(eSUBWAR!$I$21=\"Valid\",eMARKS!J50,eMARKS!K50*1.2)","v":0},{"$f":"IF(eSUBWAR!$I$21=\"Valid\",eMARKS!K50,eMARKS!L50*1.2)","v":0},{"$f":"IF(eSUBWAR!$I$21=\"Valid\",eMARKS!L50,eMARKS!M50*1.2)","v":0},{"$f":"IF(eSUBWAR!$I$21=\"Valid\",eMARKS!M50,eMARKS!N50*1.2)","v":0},{"$f":"IF(eSUBWAR!$I$21=\"Valid\",eMARKS!N50,eMARKS!#REF!*1.2)","v":0},null,null,null,null,{"$f":"IF(eSUBWAR!$I$21=\"Valid\",eMARKS!O50,eMARKS!P50*0.8)","v":0},{"$f":"IF(eSUBWAR!$I$21=\"Valid\",eMARKS!P50,eMARKS!Q50*0.8)","v":0},{"$f":"IF(eSUBWAR!$I$21=\"Valid\",eMARKS!Q50,eMARKS!R50*0.8)","v":0},{"$f":"IF(eSUBWAR!$I$21=\"Valid\",eMARKS!R50,eMARKS!S50*0.8)","v":0},{"$f":"IF(eSUBWAR!$I$21=\"Valid\",eMARKS!S50,eMARKS!T50*0.8)","v":0},{"$f":"IF(eSUBWAR!$I$21=\"Valid\",eMARKS!T50,eMARKS!#REF!*1.2)","v":0}]
[{"$f":"eSPAR!A50","v":0},{"$f":"eSPAR!B50","v":0},{"$f":"IF(eSUBWAR!$I$21=\"Valid\",eMARKS!C51,eMARKS!D51*1.7)","v":0},{"$f":"IF(eSUBWAR!$I$21=\"Valid\",eMARKS!D51,eMARKS!E51*1.7)","v":0},{"$f":"IF(eSUBWAR!$I$21=\"Valid\",eMARKS!E51,eMARKS!F51*1.7)","v":0},{"$f":"IF(eSUBWAR!$I$21=\"Valid\",eMARKS!F51,eMARKS!G51*1.7)","v":0},{"$f":"IF(eSUBWAR!$I$21=\"Valid\",eMARKS!G51,eMARKS!H51*1.7)","v":0},{"$f":"IF(eSUBWAR!$I$21=\"Valid\",eMARKS!H51,eMARKS!#REF!*1.7)","v":0},null,null,null,null,{"$f":"IF(eSUBWAR!$I$21=\"Valid\",eMARKS!I51,eMARKS!J51*1.2)","v":0},{"$f":"IF(eSUBWAR!$I$21=\"Valid\",eMARKS!J51,eMARKS!K51*1.2)","v":0},{"$f":"IF(eSUBWAR!$I$21=\"Valid\",eMARKS!K51,eMARKS!L51*1.2)","v":0},{"$f":"IF(eSUBWAR!$I$21=\"Valid\",eMARKS!L51,eMARKS!M51*1.2)","v":0},{"$f":"IF(eSUBWAR!$I$21=\"Valid\",eMARKS!M51,eMARKS!N51*1.2)","v":0},{"$f":"IF(eSUBWAR!$I$21=\"Valid\",eMARKS!N51,eMARKS!#REF!*1.2)","v":0},null,null,null,null,{"$f":"IF(eSUBWAR!$I$21=\"Valid\",eMARKS!O51,eMARKS!P51*0.8)","v":0},{"$f":"IF(eSUBWAR!$I$21=\"Valid\",eMARKS!P51,eMARKS!Q51*0.8)","v":0},{"$f":"IF(eSUBWAR!$I$21=\"Valid\",eMARKS!Q51,eMARKS!R51*0.8)","v":0},{"$f":"IF(eSUBWAR!$I$21=\"Valid\",eMARKS!R51,eMARKS!S51*0.8)","v":0},{"$f":"IF(eSUBWAR!$I$21=\"Valid\",eMARKS!S51,eMARKS!T51*0.8)","v":0},{"$f":"IF(eSUBWAR!$I$21=\"Valid\",eMARKS!T51,eMARKS!#REF!*1.2)","v":0}]
[{"$f":"eSPAR!A51","v":0},{"$f":"eSPAR!B51","v":0},{"$f":"IF(eSUBWAR!$I$21=\"Valid\",eMARKS!C52,eMARKS!D52*1.2)","v":0},{"$f":"IF(eSUBWAR!$I$21=\"Valid\",eMARKS!D52,eMARKS!E52*1.2)","v":0},{"$f":"IF(eSUBWAR!$I$21=\"Valid\",eMARKS!E52,eMARKS!F52*1.2)","v":0},{"$f":"IF(eSUBWAR!$I$21=\"Valid\",eMARKS!F52,eMARKS!G52*1.2)","v":0},{"$f":"IF(eSUBWAR!$I$21=\"Valid\",eMARKS!G52,eMARKS!H52*1.2)","v":0},{"$f":"IF(eSUBWAR!$I$21=\"Valid\",eMARKS!H52,eMARKS!#REF!*1.2)","v":0},null,null,null,null,{"$f":"IF(eSUBWAR!$I$21=\"Valid\",eMARKS!I52,eMARKS!J52*1.2)","v":0},{"$f":"IF(eSUBWAR!$I$21=\"Valid\",eMARKS!J52,eMARKS!K52*1.2)","v":0},{"$f":"IF(eSUBWAR!$I$21=\"Valid\",eMARKS!K52,eMARKS!L52*1.2)","v":0},{"$f":"IF(eSUBWAR!$I$21=\"Valid\",eMARKS!L52,eMARKS!M52*1.2)","v":0},{"$f":"IF(eSUBWAR!$I$21=\"Valid\",eMARKS!M52,eMARKS!N52*1.2)","v":0},{"$f":"IF(eSUBWAR!$I$21=\"Valid\",eMARKS!N52,eMARKS!#REF!*1.2)","v":0},null,null,null,null,{"$f":"IF(eSUBWAR!$I$21=\"Valid\",eMARKS!O52,eMARKS!P52*0.8)","v":0},{"$f":"IF(eSUBWAR!$I$21=\"Valid\",eMARKS!P52,eMARKS!Q52*0.8)","v":0},{"$f":"IF(eSUBWAR!$I$21=\"Valid\",eMARKS!Q52,eMARKS!R52*0.8)","v":0},{"$f":"IF(eSUBWAR!$I$21=\"Valid\",eMARKS!R52,eMARKS!S52*0.8)","v":0},{"$f":"IF(eSUBWAR!$I$21=\"Valid\",eMARKS!S52,eMARKS!T52*0.8)","v":0},{"$f":"IF(eSUBWAR!$I$21=\"Valid\",eMARKS!T52,eMARKS!#REF!*1.2)","v":0}]
[{"$f":"eSPAR!A52","v":0},{"$f":"eSPAR!B52","v":0},{"$f":"IF(eSUBWAR!$I$21=\"Valid\",eMARKS!C53,eMARKS!D53*1.2)","v":0},{"$f":"IF(eSUBWAR!$I$21=\"Valid\",eMARKS!D53,eMARKS!E53*1.2)","v":0},{"$f":"IF(eSUBWAR!$I$21=\"Valid\",eMARKS!E53,eMARKS!F53*1.2)","v":0},{"$f":"IF(eSUBWAR!$I$21=\"Valid\",eMARKS!F53,eMARKS!G53*1.2)","v":0},{"$f":"IF(eSUBWAR!$I$21=\"Valid\",eMARKS!G53,eMARKS!H53*1.2)","v":0},{"$f":"IF(eSUBWAR!$I$21=\"Valid\",eMARKS!H53,eMARKS!#REF!*1.2)","v":0},null,null,null,null,{"$f":"IF(eSUBWAR!$I$21=\"Valid\",eMARKS!I53,eMARKS!J53*1.2)","v":0},{"$f":"IF(eSUBWAR!$I$21=\"Valid\",eMARKS!J53,eMARKS!K53*1.2)","v":0},{"$f":"IF(eSUBWAR!$I$21=\"Valid\",eMARKS!K53,eMARKS!L53*1.2)","v":0},{"$f":"IF(eSUBWAR!$I$21=\"Valid\",eMARKS!L53,eMARKS!M53*1.2)","v":0},{"$f":"IF(eSUBWAR!$I$21=\"Valid\",eMARKS!M53,eMARKS!N53*1.2)","v":0},{"$f":"IF(eSUBWAR!$I$21=\"Valid\",eMARKS!N53,eMARKS!#REF!*1.2)","v":0},null,null,null,null,{"$f":"IF(eSUBWAR!$I$21=\"Valid\",eMARKS!O53,eMARKS!P53*0.8)","v":0},{"$f":"IF(eSUBWAR!$I$21=\"Valid\",eMARKS!P53,eMARKS!Q53*0.8)","v":0},{"$f":"IF(eSUBWAR!$I$21=\"Valid\",eMARKS!Q53,eMARKS!R53*0.8)","v":0},{"$f":"IF(eSUBWAR!$I$21=\"Valid\",eMARKS!R53,eMARKS!S53*0.8)","v":0},{"$f":"IF(eSUBWAR!$I$21=\"Valid\",eMARKS!S53,eMARKS!T53*0.8)","v":0},{"$f":"IF(eSUBWAR!$I$21=\"Valid\",eMARKS!T53,eMARKS!#REF!*1.2)","v":0}]
[{"$f":"eSPAR!A53","v":0},{"$f":"eSPAR!B53","v":0},{"$f":"IF(eSUBWAR!$I$21=\"Valid\",eMARKS!C54,eMARKS!D54*1.2)","v":0},{"$f":"IF(eSUBWAR!$I$21=\"Valid\",eMARKS!D54,eMARKS!E54*1.2)","v":0},{"$f":"IF(eSUBWAR!$I$21=\"Valid\",eMARKS!E54,eMARKS!F54*1.2)","v":0},{"$f":"IF(eSUBWAR!$I$21=\"Valid\",eMARKS!F54,eMARKS!G54*1.2)","v":0},{"$f":"IF(eSUBWAR!$I$21=\"Valid\",eMARKS!G54,eMARKS!H54*1.2)","v":0},{"$f":"IF(eSUBWAR!$I$21=\"Valid\",eMARKS!H54,eMARKS!#REF!*1.2)","v":0},null,null,null,null,{"$f":"IF(eSUBWAR!$I$21=\"Valid\",eMARKS!I54,eMARKS!J54*1.2)","v":0},{"$f":"IF(eSUBWAR!$I$21=\"Valid\",eMARKS!J54,eMARKS!K54*1.2)","v":0},{"$f":"IF(eSUBWAR!$I$21=\"Valid\",eMARKS!K54,eMARKS!L54*1.2)","v":0},{"$f":"IF(eSUBWAR!$I$21=\"Valid\",eMARKS!L54,eMARKS!M54*1.2)","v":0},{"$f":"IF(eSUBWAR!$I$21=\"Valid\",eMARKS!M54,eMARKS!N54*1.2)","v":0},{"$f":"IF(eSUBWAR!$I$21=\"Valid\",eMARKS!N54,eMARKS!#REF!*1.2)","v":0},null,null,null,null,{"$f":"IF(eSUBWAR!$I$21=\"Valid\",eMARKS!O54,eMARKS!P54*0.8)","v":0},{"$f":"IF(eSUBWAR!$I$21=\"Valid\",eMARKS!P54,eMARKS!Q54*0.8)","v":0},{"$f":"IF(eSUBWAR!$I$21=\"Valid\",eMARKS!Q54,eMARKS!R54*0.8)","v":0},{"$f":"IF(eSUBWAR!$I$21=\"Valid\",eMARKS!R54,eMARKS!S54*0.8)","v":0},{"$f":"IF(eSUBWAR!$I$21=\"Valid\",eMARKS!S54,eMARKS!T54*0.8)","v":0},{"$f":"IF(eSUBWAR!$I$21=\"Valid\",eMARKS!T54,eMARKS!#REF!*1.2)","v":0}]
[{"$f":"eSPAR!A54","v":0},{"$f":"eSPAR!B54","v":0},{"$f":"IF(eSUBWAR!$I$21=\"Valid\",eMARKS!C55,eMARKS!D55*1.2)","v":0},{"$f":"IF(eSUBWAR!$I$21=\"Valid\",eMARKS!D55,eMARKS!E55*1.2)","v":0},{"$f":"IF(eSUBWAR!$I$21=\"Valid\",eMARKS!E55,eMARKS!F55*1.2)","v":0},{"$f":"IF(eSUBWAR!$I$21=\"Valid\",eMARKS!F55,eMARKS!G55*1.2)","v":0},{"$f":"IF(eSUBWAR!$I$21=\"Valid\",eMARKS!G55,eMARKS!H55*1.2)","v":0},{"$f":"IF(eSUBWAR!$I$21=\"Valid\",eMARKS!H55,eMARKS!#REF!*1.2)","v":0},null,null,null,null,{"$f":"IF(eSUBWAR!$I$21=\"Valid\",eMARKS!I55,eMARKS!J55*1.2)","v":0},{"$f":"IF(eSUBWAR!$I$21=\"Valid\",eMARKS!J55,eMARKS!K55*1.2)","v":0},{"$f":"IF(eSUBWAR!$I$21=\"Valid\",eMARKS!K55,eMARKS!L55*1.2)","v":0},{"$f":"IF(eSUBWAR!$I$21=\"Valid\",eMARKS!L55,eMARKS!M55*1.2)","v":0},{"$f":"IF(eSUBWAR!$I$21=\"Valid\",eMARKS!M55,eMARKS!N55*1.2)","v":0},{"$f":"IF(eSUBWAR!$I$21=\"Valid\",eMARKS!N55,eMARKS!#REF!*1.2)","v":0},null,null,null,null,{"$f":"IF(eSUBWAR!$I$21=\"Valid\",eMARKS!O55,eMARKS!P55*0.8)","v":0},{"$f":"IF(eSUBWAR!$I$21=\"Valid\",eMARKS!P55,eMARKS!Q55*0.8)","v":0},{"$f":"IF(eSUBWAR!$I$21=\"Valid\",eMARKS!Q55,eMARKS!R55*0.8)","v":0},{"$f":"IF(eSUBWAR!$I$21=\"Valid\",eMARKS!R55,eMARKS!S55*0.8)","v":0},{"$f":"IF(eSUBWAR!$I$21=\"Valid\",eMARKS!S55,eMARKS!T55*0.8)","v":0},{"$f":"IF(eSUBWAR!$I$21=\"Valid\",eMARKS!T55,eMARKS!#REF!*1.2)","v":0}]
[{"$f":"eSPAR!A55","v":0},{"$f":"eSPAR!B55","v":0},{"$f":"IF(eSUBWAR!$I$21=\"Valid\",eMARKS!C56,eMARKS!D56*1.2)","v":0},{"$f":"IF(eSUBWAR!$I$21=\"Valid\",eMARKS!D56,eMARKS!E56*1.2)","v":0},{"$f":"IF(eSUBWAR!$I$21=\"Valid\",eMARKS!E56,eMARKS!F56*1.2)","v":0},{"$f":"IF(eSUBWAR!$I$21=\"Valid\",eMARKS!F56,eMARKS!G56*1.2)","v":0},{"$f":"IF(eSUBWAR!$I$21=\"Valid\",eMARKS!G56,eMARKS!H56*1.2)","v":0},{"$f":"IF(eSUBWAR!$I$21=\"Valid\",eMARKS!H56,eMARKS!#REF!*1.2)","v":0},null,null,null,null,{"$f":"IF(eSUBWAR!$I$21=\"Valid\",eMARKS!I56,eMARKS!J56*1.2)","v":0},{"$f":"IF(eSUBWAR!$I$21=\"Valid\",eMARKS!J56,eMARKS!K56*1.2)","v":0},{"$f":"IF(eSUBWAR!$I$21=\"Valid\",eMARKS!K56,eMARKS!L56*1.2)","v":0},{"$f":"IF(eSUBWAR!$I$21=\"Valid\",eMARKS!L56,eMARKS!M56*1.2)","v":0},{"$f":"IF(eSUBWAR!$I$21=\"Valid\",eMARKS!M56,eMARKS!N56*1.2)","v":0},{"$f":"IF(eSUBWAR!$I$21=\"Valid\",eMARKS!N56,eMARKS!#REF!*1.2)","v":0},null,null,null,null,{"$f":"IF(eSUBWAR!$I$21=\"Valid\",eMARKS!O56,eMARKS!P56*1.2)","v":0},{"$f":"IF(eSUBWAR!$I$21=\"Valid\",eMARKS!P56,eMARKS!Q56*1.2)","v":0},{"$f":"IF(eSUBWAR!$I$21=\"Valid\",eMARKS!Q56,eMARKS!R56*1.2)","v":0},{"$f":"IF(eSUBWAR!$I$21=\"Valid\",eMARKS!R56,eMARKS!S56*1.2)","v":0},{"$f":"IF(eSUBWAR!$I$21=\"Valid\",eMARKS!S56,eMARKS!T56*1.2)","v":0},{"$f":"IF(eSUBWAR!$I$21=\"Valid\",eMARKS!T56,eMARKS!#REF!*1.2)","v":0}]
[{"$f":"eSPAR!A56","v":0},{"$f":"eSPAR!B56","v":0},{"$f":"IF(eSUBWAR!$I$21=\"Valid\",eMARKS!C57,eMARKS!D57*1.2)","v":0},{"$f":"IF(eSUBWAR!$I$21=\"Valid\",eMARKS!D57,eMARKS!E57*1.2)","v":0},{"$f":"IF(eSUBWAR!$I$21=\"Valid\",eMARKS!E57,eMARKS!F57*1.2)","v":0},{"$f":"IF(eSUBWAR!$I$21=\"Valid\",eMARKS!F57,eMARKS!G57*1.2)","v":0},{"$f":"IF(eSUBWAR!$I$21=\"Valid\",eMARKS!G57,eMARKS!H57*1.2)","v":0},{"$f":"IF(eSUBWAR!$I$21=\"Valid\",eMARKS!H57,eMARKS!#REF!*1.2)","v":0},null,null,null,null,{"$f":"IF(eSUBWAR!$I$21=\"Valid\",eMARKS!I57,eMARKS!J57*0.8)","v":0},{"$f":"IF(eSUBWAR!$I$21=\"Valid\",eMARKS!J57,eMARKS!K57*0.8)","v":0},{"$f":"IF(eSUBWAR!$I$21=\"Valid\",eMARKS!K57,eMARKS!L57*0.8)","v":0},{"$f":"IF(eSUBWAR!$I$21=\"Valid\",eMARKS!L57,eMARKS!M57*0.8)","v":0},{"$f":"IF(eSUBWAR!$I$21=\"Valid\",eMARKS!M57,eMARKS!N57*1.2)","v":0},{"$f":"IF(eSUBWAR!$I$21=\"Valid\",eMARKS!N57,eMARKS!#REF!*1.3)","v":0},null,null,null,null,{"$f":"IF(eSUBWAR!$I$21=\"Valid\",eMARKS!O57,eMARKS!P57*1.3)","v":0},{"$f":"IF(eSUBWAR!$I$21=\"Valid\",eMARKS!P57,eMARKS!Q57*1.2)","v":0},{"$f":"IF(eSUBWAR!$I$21=\"Valid\",eMARKS!Q57,eMARKS!R57*1.2)","v":0},{"$f":"IF(eSUBWAR!$I$21=\"Valid\",eMARKS!R57,eMARKS!S57*1.2)","v":0},{"$f":"IF(eSUBWAR!$I$21=\"Valid\",eMARKS!S57,eMARKS!T57*1.2)","v":0},{"$f":"IF(eSUBWAR!$I$21=\"Valid\",eMARKS!T57,eMARKS!#REF!*1.2)","v":0}]
[{"$f":"eSPAR!A57","v":0},{"$f":"eSPAR!B57","v":0},{"$f":"IF(eSUBWAR!$I$21=\"Valid\",eMARKS!C58,eMARKS!D58*1.2)","v":0},{"$f":"IF(eSUBWAR!$I$21=\"Valid\",eMARKS!D58,eMARKS!E58*1.2)","v":0},{"$f":"IF(eSUBWAR!$I$21=\"Valid\",eMARKS!E58,eMARKS!F58*1.2)","v":0},{"$f":"IF(eSUBWAR!$I$21=\"Valid\",eMARKS!F58,eMARKS!G58*1.2)","v":0},{"$f":"IF(eSUBWAR!$I$21=\"Valid\",eMARKS!G58,eMARKS!H58*1.2)","v":0},{"$f":"IF(eSUBWAR!$I$21=\"Valid\",eMARKS!H58,eMARKS!#REF!*1.2)","v":0},null,null,null,null,{"$f":"IF(eSUBWAR!$I$21=\"Valid\",eMARKS!I58,eMARKS!J58*0.8)","v":0},{"$f":"IF(eSUBWAR!$I$21=\"Valid\",eMARKS!J58,eMARKS!K58*0.8)","v":0},{"$f":"IF(eSUBWAR!$I$21=\"Valid\",eMARKS!K58,eMARKS!L58*0.8)","v":0},{"$f":"IF(eSUBWAR!$I$21=\"Valid\",eMARKS!L58,eMARKS!M58*0.8)","v":0},{"$f":"IF(eSUBWAR!$I$21=\"Valid\",eMARKS!M58,eMARKS!N58*1.2)","v":0},{"$f":"IF(eSUBWAR!$I$21=\"Valid\",eMARKS!N58,eMARKS!#REF!*1.3)","v":0},null,null,null,null,{"$f":"IF(eSUBWAR!$I$21=\"Valid\",eMARKS!O58,eMARKS!P58*1.3)","v":0},{"$f":"IF(eSUBWAR!$I$21=\"Valid\",eMARKS!P58,eMARKS!Q58*1.2)","v":0},{"$f":"IF(eSUBWAR!$I$21=\"Valid\",eMARKS!Q58,eMARKS!R58*1.2)","v":0},{"$f":"IF(eSUBWAR!$I$21=\"Valid\",eMARKS!R58,eMARKS!S58*1.2)","v":0},{"$f":"IF(eSUBWAR!$I$21=\"Valid\",eMARKS!S58,eMARKS!T58*1.2)","v":0},{"$f":"IF(eSUBWAR!$I$21=\"Valid\",eMARKS!T58,eMARKS!#REF!*1.2)","v":0}]
[{"$f":"eSPAR!A58","v":0},{"$f":"eSPAR!B58","v":0},{"$f":"IF(eSUBWAR!$I$21=\"Valid\",eMARKS!C59,eMARKS!D59*1.2)","v":0},{"$f":"IF(eSUBWAR!$I$21=\"Valid\",eMARKS!D59,eMARKS!E59*1.2)","v":0},{"$f":"IF(eSUBWAR!$I$21=\"Valid\",eMARKS!E59,eMARKS!F59*1.2)","v":0},{"$f":"IF(eSUBWAR!$I$21=\"Valid\",eMARKS!F59,eMARKS!G59*1.2)","v":0},{"$f":"IF(eSUBWAR!$I$21=\"Valid\",eMARKS!G59,eMARKS!H59*1.2)","v":0},{"$f":"IF(eSUBWAR!$I$21=\"Valid\",eMARKS!H59,eMARKS!#REF!*1.2)","v":0},null,null,null,null,{"$f":"IF(eSUBWAR!$I$21=\"Valid\",eMARKS!I59,eMARKS!J59*0.8)","v":0},{"$f":"IF(eSUBWAR!$I$21=\"Valid\",eMARKS!J59,eMARKS!K59*0.8)","v":0},{"$f":"IF(eSUBWAR!$I$21=\"Valid\",eMARKS!K59,eMARKS!L59*0.8)","v":0},{"$f":"IF(eSUBWAR!$I$21=\"Valid\",eMARKS!L59,eMARKS!M59*0.8)","v":0},{"$f":"IF(eSUBWAR!$I$21=\"Valid\",eMARKS!M59,eMARKS!N59*1.2)","v":0},{"$f":"IF(eSUBWAR!$I$21=\"Valid\",eMARKS!N59,eMARKS!#REF!*1.3)","v":0},null,null,null,null,{"$f":"IF(eSUBWAR!$I$21=\"Valid\",eMARKS!O59,eMARKS!P59*1.3)","v":0},{"$f":"IF(eSUBWAR!$I$21=\"Valid\",eMARKS!P59,eMARKS!Q59*1.2)","v":0},{"$f":"IF(eSUBWAR!$I$21=\"Valid\",eMARKS!Q59,eMARKS!R59*1.2)","v":0},{"$f":"IF(eSUBWAR!$I$21=\"Valid\",eMARKS!R59,eMARKS!S59*1.2)","v":0},{"$f":"IF(eSUBWAR!$I$21=\"Valid\",eMARKS!S59,eMARKS!T59*1.2)","v":0},{"$f":"IF(eSUBWAR!$I$21=\"Valid\",eMARKS!T59,eMARKS!#REF!*1.2)","v":0}]
[{"$f":"eSPAR!A59","v":0},{"$f":"eSPAR!B59","v":0},{"$f":"IF(eSUBWAR!$I$21=\"Valid\",eMARKS!C60,eMARKS!D60*1.2)","v":0},{"$f":"IF(eSUBWAR!$I$21=\"Valid\",eMARKS!D60,eMARKS!E60*1.2)","v":0},{"$f":"IF(eSUBWAR!$I$21=\"Valid\",eMARKS!E60,eMARKS!F60*1.2)","v":0},{"$f":"IF(eSUBWAR!$I$21=\"Valid\",eMARKS!F60,eMARKS!G60*1.2)","v":0},{"$f":"IF(eSUBWAR!$I$21=\"Valid\",eMARKS!G60,eMARKS!H60*1.2)","v":0},{"$f":"IF(eSUBWAR!$I$21=\"Valid\",eMARKS!H60,eMARKS!#REF!*1.2)","v":0},null,null,null,null,{"$f":"IF(eSUBWAR!$I$21=\"Valid\",eMARKS!I60,eMARKS!J60*0.8)","v":0},{"$f":"IF(eSUBWAR!$I$21=\"Valid\",eMARKS!J60,eMARKS!K60*0.8)","v":0},{"$f":"IF(eSUBWAR!$I$21=\"Valid\",eMARKS!K60,eMARKS!L60*0.8)","v":0},{"$f":"IF(eSUBWAR!$I$21=\"Valid\",eMARKS!L60,eMARKS!M60*0.8)","v":0},{"$f":"IF(eSUBWAR!$I$21=\"Valid\",eMARKS!M60,eMARKS!N60*1.2)","v":0},{"$f":"IF(eSUBWAR!$I$21=\"Valid\",eMARKS!N60,eMARKS!#REF!*1.3)","v":0},null,null,null,null,{"$f":"IF(eSUBWAR!$I$21=\"Valid\",eMARKS!O60,eMARKS!P60*1.3)","v":0},{"$f":"IF(eSUBWAR!$I$21=\"Valid\",eMARKS!P60,eMARKS!Q60*1.2)","v":0},{"$f":"IF(eSUBWAR!$I$21=\"Valid\",eMARKS!Q60,eMARKS!R60*1.2)","v":0},{"$f":"IF(eSUBWAR!$I$21=\"Valid\",eMARKS!R60,eMARKS!S60*1.2)","v":0},{"$f":"IF(eSUBWAR!$I$21=\"Valid\",eMARKS!S60,eMARKS!T60*1.2)","v":0},{"$f":"IF(eSUBWAR!$I$21=\"Valid\",eMARKS!T60,eMARKS!#REF!*1.2)","v":0}]
[{"$f":"eSPAR!A60","v":0},{"$f":"eSPAR!B60","v":0},{"$f":"IF(eSUBWAR!$I$21=\"Valid\",eMARKS!C61,eMARKS!D61*1.2)","v":0},{"$f":"IF(eSUBWAR!$I$21=\"Valid\",eMARKS!D61,eMARKS!E61*1.2)","v":0},{"$f":"IF(eSUBWAR!$I$21=\"Valid\",eMARKS!E61,eMARKS!F61*1.2)","v":0},{"$f":"IF(eSUBWAR!$I$21=\"Valid\",eMARKS!F61,eMARKS!G61*1.2)","v":0},{"$f":"IF(eSUBWAR!$I$21=\"Valid\",eMARKS!G61,eMARKS!H61*1.2)","v":0},{"$f":"IF(eSUBWAR!$I$21=\"Valid\",eMARKS!H61,eMARKS!#REF!*1.2)","v":0},null,null,null,null,{"$f":"IF(eSUBWAR!$I$21=\"Valid\",eMARKS!I61,eMARKS!J61*0.8)","v":0},{"$f":"IF(eSUBWAR!$I$21=\"Valid\",eMARKS!J61,eMARKS!K61*0.8)","v":0},{"$f":"IF(eSUBWAR!$I$21=\"Valid\",eMARKS!K61,eMARKS!L61*0.8)","v":0},{"$f":"IF(eSUBWAR!$I$21=\"Valid\",eMARKS!L61,eMARKS!M61*0.8)","v":0},{"$f":"IF(eSUBWAR!$I$21=\"Valid\",eMARKS!M61,eMARKS!N61*1.2)","v":0},{"$f":"IF(eSUBWAR!$I$21=\"Valid\",eMARKS!N61,eMARKS!#REF!*1.3)","v":0},null,null,null,null,{"$f":"IF(eSUBWAR!$I$21=\"Valid\",eMARKS!O61,eMARKS!P61*1.3)","v":0},{"$f":"IF(eSUBWAR!$I$21=\"Valid\",eMARKS!P61,eMARKS!Q61*1.2)","v":0},{"$f":"IF(eSUBWAR!$I$21=\"Valid\",eMARKS!Q61,eMARKS!R61*1.2)","v":0},{"$f":"IF(eSUBWAR!$I$21=\"Valid\",eMARKS!R61,eMARKS!S61*1.2)","v":0},{"$f":"IF(eSUBWAR!$I$21=\"Valid\",eMARKS!S61,eMARKS!T61*1.2)","v":0},{"$f":"IF(eSUBWAR!$I$21=\"Valid\",eMARKS!T61,eMARKS!#REF!*1.2)","v":0}]
[{"$f":"eSPAR!A61","v":0},{"$f":"eSPAR!B61","v":0},{"$f":"IF(eSUBWAR!$I$21=\"Valid\",eMARKS!C62,eMARKS!D62*1.2)","v":0},{"$f":"IF(eSUBWAR!$I$21=\"Valid\",eMARKS!D62,eMARKS!E62*1.2)","v":0},{"$f":"IF(eSUBWAR!$I$21=\"Valid\",eMARKS!E62,eMARKS!F62*1.2)","v":0},{"$f":"IF(eSUBWAR!$I$21=\"Valid\",eMARKS!F62,eMARKS!G62*1.2)","v":0},{"$f":"IF(eSUBWAR!$I$21=\"Valid\",eMARKS!G62,eMARKS!H62*1.2)","v":0},{"$f":"IF(eSUBWAR!$I$21=\"Valid\",eMARKS!H62,eMARKS!#REF!*1.2)","v":0},null,null,null,null,{"$f":"IF(eSUBWAR!$I$21=\"Valid\",eMARKS!I62,eMARKS!J62*0.8)","v":0},{"$f":"IF(eSUBWAR!$I$21=\"Valid\",eMARKS!J62,eMARKS!K62*0.8)","v":0},{"$f":"IF(eSUBWAR!$I$21=\"Valid\",eMARKS!K62,eMARKS!L62*0.8)","v":0},{"$f":"IF(eSUBWAR!$I$21=\"Valid\",eMARKS!L62,eMARKS!M62*0.8)","v":0},{"$f":"IF(eSUBWAR!$I$21=\"Valid\",eMARKS!M62,eMARKS!N62*1.2)","v":0},{"$f":"IF(eSUBWAR!$I$21=\"Valid\",eMARKS!N62,eMARKS!#REF!*1.3)","v":0},null,null,null,null,{"$f":"IF(eSUBWAR!$I$21=\"Valid\",eMARKS!O62,eMARKS!P62*1.3)","v":0},{"$f":"IF(eSUBWAR!$I$21=\"Valid\",eMARKS!P62,eMARKS!Q62*1.2)","v":0},{"$f":"IF(eSUBWAR!$I$21=\"Valid\",eMARKS!Q62,eMARKS!R62*1.2)","v":0},{"$f":"IF(eSUBWAR!$I$21=\"Valid\",eMARKS!R62,eMARKS!S62*1.2)","v":0},{"$f":"IF(eSUBWAR!$I$21=\"Valid\",eMARKS!S62,eMARKS!T62*1.2)","v":0},{"$f":"IF(eSUBWAR!$I$21=\"Valid\",eMARKS!T62,eMARKS!#REF!*1.2)","v":0}]
[{"$f":"eSPAR!A62","v":0},{"$f":"eSPAR!B62","v":0},{"$f":"IF(eSUBWAR!$I$21=\"Valid\",eMARKS!C63,eMARKS!D63*1.2)","v":0},{"$f":"IF(eSUBWAR!$I$21=\"Valid\",eMARKS!D63,eMARKS!E63*1.2)","v":0},{"$f":"IF(eSUBWAR!$I$21=\"Valid\",eMARKS!E63,eMARKS!F63*1.7)","v":0},{"$f":"IF(eSUBWAR!$I$21=\"Valid\",eMARKS!F63,eMARKS!G63*1.7)","v":0},{"$f":"IF(eSUBWAR!$I$21=\"Valid\",eMARKS!G63,eMARKS!H63*1.7)","v":0},{"$f":"IF(eSUBWAR!$I$21=\"Valid\",eMARKS!H63,eMARKS!#REF!*1.7)","v":0},null,null,null,null,{"$f":"IF(eSUBWAR!$I$21=\"Valid\",eMARKS!I63,eMARKS!J63*0.8)","v":0},{"$f":"IF(eSUBWAR!$I$21=\"Valid\",eMARKS!J63,eMARKS!K63*0.8)","v":0},{"$f":"IF(eSUBWAR!$I$21=\"Valid\",eMARKS!K63,eMARKS!L63*0.8)","v":0},{"$f":"IF(eSUBWAR!$I$21=\"Valid\",eMARKS!L63,eMARKS!M63*0.8)","v":0},{"$f":"IF(eSUBWAR!$I$21=\"Valid\",eMARKS!M63,eMARKS!N63*1.2)","v":0},{"$f":"IF(eSUBWAR!$I$21=\"Valid\",eMARKS!N63,eMARKS!#REF!*1.3)","v":0},null,null,null,null,{"$f":"IF(eSUBWAR!$I$21=\"Valid\",eMARKS!O63,eMARKS!P63*1.3)","v":0},{"$f":"IF(eSUBWAR!$I$21=\"Valid\",eMARKS!P63,eMARKS!Q63*1.2)","v":0},{"$f":"IF(eSUBWAR!$I$21=\"Valid\",eMARKS!Q63,eMARKS!R63*1.2)","v":0},{"$f":"IF(eSUBWAR!$I$21=\"Valid\",eMARKS!R63,eMARKS!S63*1.2)","v":0},{"$f":"IF(eSUBWAR!$I$21=\"Valid\",eMARKS!S63,eMARKS!T63*1.2)","v":0},{"$f":"IF(eSUBWAR!$I$21=\"Valid\",eMARKS!T63,eMARKS!#REF!*1.2)","v":0}]
[{"$f":"eSPAR!A63","v":0},{"$f":"eSPAR!B63","v":0},{"$f":"IF(eSUBWAR!$I$21=\"Valid\",eMARKS!C64,eMARKS!D64*1.2)","v":0},{"$f":"IF(eSUBWAR!$I$21=\"Valid\",eMARKS!D64,eMARKS!E64*1.2)","v":0},{"$f":"IF(eSUBWAR!$I$21=\"Valid\",eMARKS!E64,eMARKS!F64*1.7)","v":0},{"$f":"IF(eSUBWAR!$I$21=\"Valid\",eMARKS!F64,eMARKS!G64*1.7)","v":0},{"$f":"IF(eSUBWAR!$I$21=\"Valid\",eMARKS!G64,eMARKS!H64*1.7)","v":0},{"$f":"IF(eSUBWAR!$I$21=\"Valid\",eMARKS!H64,eMARKS!#REF!*1.7)","v":0},null,null,null,null,{"$f":"IF(eSUBWAR!$I$21=\"Valid\",eMARKS!I64,eMARKS!J64*0.8)","v":0},{"$f":"IF(eSUBWAR!$I$21=\"Valid\",eMARKS!J64,eMARKS!K64*0.8)","v":0},{"$f":"IF(eSUBWAR!$I$21=\"Valid\",eMARKS!K64,eMARKS!L64*0.8)","v":0},{"$f":"IF(eSUBWAR!$I$21=\"Valid\",eMARKS!L64,eMARKS!M64*0.8)","v":0},{"$f":"IF(eSUBWAR!$I$21=\"Valid\",eMARKS!M64,eMARKS!N64*1.2)","v":0},{"$f":"IF(eSUBWAR!$I$21=\"Valid\",eMARKS!N64,eMARKS!#REF!*1.3)","v":0},null,null,null,null,{"$f":"IF(eSUBWAR!$I$21=\"Valid\",eMARKS!O64,eMARKS!P64*1.3)","v":0},{"$f":"IF(eSUBWAR!$I$21=\"Valid\",eMARKS!P64,eMARKS!Q64*1.2)","v":0},{"$f":"IF(eSUBWAR!$I$21=\"Valid\",eMARKS!Q64,eMARKS!R64*1.2)","v":0},{"$f":"IF(eSUBWAR!$I$21=\"Valid\",eMARKS!R64,eMARKS!S64*1.2)","v":0},{"$f":"IF(eSUBWAR!$I$21=\"Valid\",eMARKS!S64,eMARKS!T64*1.2)","v":0},{"$f":"IF(eSUBWAR!$I$21=\"Valid\",eMARKS!T64,eMARKS!#REF!*1.2)","v":0}]
[{"$f":"eSPAR!A64","v":0},{"$f":"eSPAR!B64","v":0},{"$f":"IF(eSUBWAR!$I$21=\"Valid\",eMARKS!C65,eMARKS!D65*1.2)","v":0},{"$f":"IF(eSUBWAR!$I$21=\"Valid\",eMARKS!D65,eMARKS!E65*1.2)","v":0},{"$f":"IF(eSUBWAR!$I$21=\"Valid\",eMARKS!E65,eMARKS!F65*1.7)","v":0},{"$f":"IF(eSUBWAR!$I$21=\"Valid\",eMARKS!F65,eMARKS!G65*1.7)","v":0},{"$f":"IF(eSUBWAR!$I$21=\"Valid\",eMARKS!G65,eMARKS!H65*1.7)","v":0},{"$f":"IF(eSUBWAR!$I$21=\"Valid\",eMARKS!H65,eMARKS!#REF!*1.7)","v":0},null,null,null,null,{"$f":"IF(eSUBWAR!$I$21=\"Valid\",eMARKS!I65,eMARKS!J65*1.2)","v":0},{"$f":"IF(eSUBWAR!$I$21=\"Valid\",eMARKS!J65,eMARKS!K65*1.2)","v":0},{"$f":"IF(eSUBWAR!$I$21=\"Valid\",eMARKS!K65,eMARKS!L65*1.2)","v":0},{"$f":"IF(eSUBWAR!$I$21=\"Valid\",eMARKS!L65,eMARKS!M65*1.2)","v":0},{"$f":"IF(eSUBWAR!$I$21=\"Valid\",eMARKS!M65,eMARKS!N65*1.2)","v":0},{"$f":"IF(eSUBWAR!$I$21=\"Valid\",eMARKS!N65,eMARKS!#REF!*1.2)","v":0},null,null,null,null,{"$f":"IF(eSUBWAR!$I$21=\"Valid\",eMARKS!O65,eMARKS!P65*1.2)","v":0},{"$f":"IF(eSUBWAR!$I$21=\"Valid\",eMARKS!P65,eMARKS!Q65*1.2)","v":0},{"$f":"IF(eSUBWAR!$I$21=\"Valid\",eMARKS!Q65,eMARKS!R65*1.2)","v":0},{"$f":"IF(eSUBWAR!$I$21=\"Valid\",eMARKS!R65,eMARKS!S65*1.2)","v":0},{"$f":"IF(eSUBWAR!$I$21=\"Valid\",eMARKS!S65,eMARKS!T65*1.2)","v":0},{"$f":"IF(eSUBWAR!$I$21=\"Valid\",eMARKS!T65,eMARKS!#REF!*1.2)","v":0}]
[{"$f":"eSPAR!A65","v":0},{"$f":"eSPAR!B65","v":0},{"$f":"IF(eSUBWAR!$I$21=\"Valid\",eMARKS!C66,eMARKS!D66*1.2)","v":0},{"$f":"IF(eSUBWAR!$I$21=\"Valid\",eMARKS!D66,eMARKS!E66*1.2)","v":0},{"$f":"IF(eSUBWAR!$I$21=\"Valid\",eMARKS!E66,eMARKS!F66*1.7)","v":0},{"$f":"IF(eSUBWAR!$I$21=\"Valid\",eMARKS!F66,eMARKS!G66*1.7)","v":0},{"$f":"IF(eSUBWAR!$I$21=\"Valid\",eMARKS!G66,eMARKS!H66*1.7)","v":0},{"$f":"IF(eSUBWAR!$I$21=\"Valid\",eMARKS!H66,eMARKS!#REF!*1.3)","v":0},null,null,null,null,{"$f":"IF(eSUBWAR!$I$21=\"Valid\",eMARKS!I66,eMARKS!J66*1.3)","v":0},{"$f":"IF(eSUBWAR!$I$21=\"Valid\",eMARKS!J66,eMARKS!K66*1.3)","v":0},{"$f":"IF(eSUBWAR!$I$21=\"Valid\",eMARKS!K66,eMARKS!L66*1.2)","v":0},{"$f":"IF(eSUBWAR!$I$21=\"Valid\",eMARKS!L66,eMARKS!M66*1.2)","v":0},{"$f":"IF(eSUBWAR!$I$21=\"Valid\",eMARKS!M66,eMARKS!N66*1.2)","v":0},{"$f":"IF(eSUBWAR!$I$21=\"Valid\",eMARKS!N66,eMARKS!#REF!*1.2)","v":0},null,null,null,null,{"$f":"IF(eSUBWAR!$I$21=\"Valid\",eMARKS!O66,eMARKS!P66*1.2)","v":0},{"$f":"IF(eSUBWAR!$I$21=\"Valid\",eMARKS!P66,eMARKS!Q66*1.2)","v":0},{"$f":"IF(eSUBWAR!$I$21=\"Valid\",eMARKS!Q66,eMARKS!R66*1.2)","v":0},{"$f":"IF(eSUBWAR!$I$21=\"Valid\",eMARKS!R66,eMARKS!S66*1.7)","v":0},{"$f":"IF(eSUBWAR!$I$21=\"Valid\",eMARKS!S66,eMARKS!T66*1.7)","v":0},{"$f":"IF(eSUBWAR!$I$21=\"Valid\",eMARKS!T66,eMARKS!#REF!*1.7)","v":0}]
[{"$f":"eSPAR!A66","v":0},{"$f":"eSPAR!B66","v":0},{"$f":"IF(eSUBWAR!$I$21=\"Valid\",eMARKS!C67,eMARKS!D67*1.2)","v":0},{"$f":"IF(eSUBWAR!$I$21=\"Valid\",eMARKS!D67,eMARKS!E67*1.2)","v":0},{"$f":"IF(eSUBWAR!$I$21=\"Valid\",eMARKS!E67,eMARKS!F67*1.7)","v":0},{"$f":"IF(eSUBWAR!$I$21=\"Valid\",eMARKS!F67,eMARKS!G67*1.7)","v":0},{"$f":"IF(eSUBWAR!$I$21=\"Valid\",eMARKS!G67,eMARKS!H67*1.7)","v":0},{"$f":"IF(eSUBWAR!$I$21=\"Valid\",eMARKS!H67,eMARKS!#REF!*1.3)","v":0},null,null,null,null,{"$f":"IF(eSUBWAR!$I$21=\"Valid\",eMARKS!I67,eMARKS!J67*1.3)","v":0},{"$f":"IF(eSUBWAR!$I$21=\"Valid\",eMARKS!J67,eMARKS!K67*1.3)","v":0},{"$f":"IF(eSUBWAR!$I$21=\"Valid\",eMARKS!K67,eMARKS!L67*1.2)","v":0},{"$f":"IF(eSUBWAR!$I$21=\"Valid\",eMARKS!L67,eMARKS!M67*1.2)","v":0},{"$f":"IF(eSUBWAR!$I$21=\"Valid\",eMARKS!M67,eMARKS!N67*1.2)","v":0},{"$f":"IF(eSUBWAR!$I$21=\"Valid\",eMARKS!N67,eMARKS!#REF!*1.2)","v":0},null,null,null,null,{"$f":"IF(eSUBWAR!$I$21=\"Valid\",eMARKS!O67,eMARKS!P67*1.2)","v":0},{"$f":"IF(eSUBWAR!$I$21=\"Valid\",eMARKS!P67,eMARKS!Q67*1.2)","v":0},{"$f":"IF(eSUBWAR!$I$21=\"Valid\",eMARKS!Q67,eMARKS!R67*1.2)","v":0},{"$f":"IF(eSUBWAR!$I$21=\"Valid\",eMARKS!R67,eMARKS!S67*1.7)","v":0},{"$f":"IF(eSUBWAR!$I$21=\"Valid\",eMARKS!S67,eMARKS!T67*1.7)","v":0},{"$f":"IF(eSUBWAR!$I$21=\"Valid\",eMARKS!T67,eMARKS!#REF!*0.8)","v":0}]
[{"$f":"eSPAR!A67","v":0},{"$f":"eSPAR!B67","v":0},{"$f":"IF(eSUBWAR!$I$21=\"Valid\",eMARKS!C68,eMARKS!D68*1.2)","v":0},{"$f":"IF(eSUBWAR!$I$21=\"Valid\",eMARKS!D68,eMARKS!E68*1.2)","v":0},{"$f":"IF(eSUBWAR!$I$21=\"Valid\",eMARKS!E68,eMARKS!F68*1.7)","v":0},{"$f":"IF(eSUBWAR!$I$21=\"Valid\",eMARKS!F68,eMARKS!G68*1.7)","v":0},{"$f":"IF(eSUBWAR!$I$21=\"Valid\",eMARKS!G68,eMARKS!H68*1.7)","v":0},{"$f":"IF(eSUBWAR!$I$21=\"Valid\",eMARKS!H68,eMARKS!#REF!*1.3)","v":0},null,null,null,null,{"$f":"IF(eSUBWAR!$I$21=\"Valid\",eMARKS!I68,eMARKS!J68*1.3)","v":0},{"$f":"IF(eSUBWAR!$I$21=\"Valid\",eMARKS!J68,eMARKS!K68*1.3)","v":0},{"$f":"IF(eSUBWAR!$I$21=\"Valid\",eMARKS!K68,eMARKS!L68*1.2)","v":0},{"$f":"IF(eSUBWAR!$I$21=\"Valid\",eMARKS!L68,eMARKS!M68*1.2)","v":0},{"$f":"IF(eSUBWAR!$I$21=\"Valid\",eMARKS!M68,eMARKS!N68*1.2)","v":0},{"$f":"IF(eSUBWAR!$I$21=\"Valid\",eMARKS!N68,eMARKS!#REF!*1.2)","v":0},null,null,null,null,{"$f":"IF(eSUBWAR!$I$21=\"Valid\",eMARKS!O68,eMARKS!P68*1.2)","v":0},{"$f":"IF(eSUBWAR!$I$21=\"Valid\",eMARKS!P68,eMARKS!Q68*1.2)","v":0},{"$f":"IF(eSUBWAR!$I$21=\"Valid\",eMARKS!Q68,eMARKS!R68*1.2)","v":0},{"$f":"IF(eSUBWAR!$I$21=\"Valid\",eMARKS!R68,eMARKS!S68*1.2)","v":0},{"$f":"IF(eSUBWAR!$I$21=\"Valid\",eMARKS!S68,eMARKS!T68*1.2)","v":0},{"$f":"IF(eSUBWAR!$I$21=\"Valid\",eMARKS!T68,eMARKS!#REF!*0.8)","v":0}]
[{"$f":"eSPAR!A68","v":0},{"$f":"eSPAR!B68","v":0},{"$f":"IF(eSUBWAR!$I$21=\"Valid\",eMARKS!C69,eMARKS!D69*1.2)","v":0},{"$f":"IF(eSUBWAR!$I$21=\"Valid\",eMARKS!D69,eMARKS!E69*1.2)","v":0},{"$f":"IF(eSUBWAR!$I$21=\"Valid\",eMARKS!E69,eMARKS!F69*1.2)","v":0},{"$f":"IF(eSUBWAR!$I$21=\"Valid\",eMARKS!F69,eMARKS!G69*1.2)","v":0},{"$f":"IF(eSUBWAR!$I$21=\"Valid\",eMARKS!G69,eMARKS!H69*1.2)","v":0},{"$f":"IF(eSUBWAR!$I$21=\"Valid\",eMARKS!H69,eMARKS!#REF!*1.3)","v":0},null,null,null,null,{"$f":"IF(eSUBWAR!$I$21=\"Valid\",eMARKS!I69,eMARKS!J69*1.3)","v":0},{"$f":"IF(eSUBWAR!$I$21=\"Valid\",eMARKS!J69,eMARKS!K69*1.3)","v":0},{"$f":"IF(eSUBWAR!$I$21=\"Valid\",eMARKS!K69,eMARKS!L69*1.2)","v":0},{"$f":"IF(eSUBWAR!$I$21=\"Valid\",eMARKS!L69,eMARKS!M69*1.2)","v":0},{"$f":"IF(eSUBWAR!$I$21=\"Valid\",eMARKS!M69,eMARKS!N69*1.2)","v":0},{"$f":"IF(eSUBWAR!$I$21=\"Valid\",eMARKS!N69,eMARKS!#REF!*1.2)","v":0},null,null,null,null,{"$f":"IF(eSUBWAR!$I$21=\"Valid\",eMARKS!O69,eMARKS!P69*1.2)","v":0},{"$f":"IF(eSUBWAR!$I$21=\"Valid\",eMARKS!P69,eMARKS!Q69*1.2)","v":0},{"$f":"IF(eSUBWAR!$I$21=\"Valid\",eMARKS!Q69,eMARKS!R69*1.2)","v":0},{"$f":"IF(eSUBWAR!$I$21=\"Valid\",eMARKS!R69,eMARKS!S69*1.2)","v":0},{"$f":"IF(eSUBWAR!$I$21=\"Valid\",eMARKS!S69,eMARKS!T69*1.2)","v":0},{"$f":"IF(eSUBWAR!$I$21=\"Valid\",eMARKS!T69,eMARKS!#REF!*0.8)","v":0}]
[{"$f":"eSPAR!A69","v":0},{"$f":"eSPAR!B69","v":0},{"$f":"IF(eSUBWAR!$I$21=\"Valid\",eMARKS!C70,eMARKS!D70*1.2)","v":0},{"$f":"IF(eSUBWAR!$I$21=\"Valid\",eMARKS!D70,eMARKS!E70*1.2)","v":0},{"$f":"IF(eSUBWAR!$I$21=\"Valid\",eMARKS!E70,eMARKS!F70*1.2)","v":0},{"$f":"IF(eSUBWAR!$I$21=\"Valid\",eMARKS!F70,eMARKS!G70*1.2)","v":0},{"$f":"IF(eSUBWAR!$I$21=\"Valid\",eMARKS!G70,eMARKS!H70*1.2)","v":0},{"$f":"IF(eSUBWAR!$I$21=\"Valid\",eMARKS!H70,eMARKS!#REF!*1.3)","v":0},null,null,null,null,{"$f":"IF(eSUBWAR!$I$21=\"Valid\",eMARKS!I70,eMARKS!J70*1.3)","v":0},{"$f":"IF(eSUBWAR!$I$21=\"Valid\",eMARKS!J70,eMARKS!K70*1.3)","v":0},{"$f":"IF(eSUBWAR!$I$21=\"Valid\",eMARKS!K70,eMARKS!L70*1.2)","v":0},{"$f":"IF(eSUBWAR!$I$21=\"Valid\",eMARKS!L70,eMARKS!M70*1.2)","v":0},{"$f":"IF(eSUBWAR!$I$21=\"Valid\",eMARKS!M70,eMARKS!N70*1.2)","v":0},{"$f":"IF(eSUBWAR!$I$21=\"Valid\",eMARKS!N70,eMARKS!#REF!*1.2)","v":0},null,null,null,null,{"$f":"IF(eSUBWAR!$I$21=\"Valid\",eMARKS!O70,eMARKS!P70*1.2)","v":0},{"$f":"IF(eSUBWAR!$I$21=\"Valid\",eMARKS!P70,eMARKS!Q70*1.2)","v":0},{"$f":"IF(eSUBWAR!$I$21=\"Valid\",eMARKS!Q70,eMARKS!R70*1.2)","v":0},{"$f":"IF(eSUBWAR!$I$21=\"Valid\",eMARKS!R70,eMARKS!S70*1.2)","v":0},{"$f":"IF(eSUBWAR!$I$21=\"Valid\",eMARKS!S70,eMARKS!T70*1.2)","v":0},{"$f":"IF(eSUBWAR!$I$21=\"Valid\",eMARKS!T70,eMARKS!#REF!*0.8)","v":0}]
[{"$f":"eSPAR!A70","v":0},{"$f":"eSPAR!B70","v":0},{"$f":"IF(eSUBWAR!$I$21=\"Valid\",eMARKS!C71,eMARKS!D71*1.2)","v":0},{"$f":"IF(eSUBWAR!$I$21=\"Valid\",eMARKS!D71,eMARKS!E71*1.2)","v":0},{"$f":"IF(eSUBWAR!$I$21=\"Valid\",eMARKS!E71,eMARKS!F71*1.2)","v":0},{"$f":"IF(eSUBWAR!$I$21=\"Valid\",eMARKS!F71,eMARKS!G71*1.2)","v":0},{"$f":"IF(eSUBWAR!$I$21=\"Valid\",eMARKS!G71,eMARKS!H71*1.2)","v":0},{"$f":"IF(eSUBWAR!$I$21=\"Valid\",eMARKS!H71,eMARKS!#REF!*1.3)","v":0},null,null,null,null,{"$f":"IF(eSUBWAR!$I$21=\"Valid\",eMARKS!I71,eMARKS!J71*1.3)","v":0},{"$f":"IF(eSUBWAR!$I$21=\"Valid\",eMARKS!J71,eMARKS!K71*1.3)","v":0},{"$f":"IF(eSUBWAR!$I$21=\"Valid\",eMARKS!K71,eMARKS!L71*1.2)","v":0},{"$f":"IF(eSUBWAR!$I$21=\"Valid\",eMARKS!L71,eMARKS!M71*1.2)","v":0},{"$f":"IF(eSUBWAR!$I$21=\"Valid\",eMARKS!M71,eMARKS!N71*1.2)","v":0},{"$f":"IF(eSUBWAR!$I$21=\"Valid\",eMARKS!N71,eMARKS!#REF!*1.2)","v":0},null,null,null,null,{"$f":"IF(eSUBWAR!$I$21=\"Valid\",eMARKS!O71,eMARKS!P71*1.2)","v":0},{"$f":"IF(eSUBWAR!$I$21=\"Valid\",eMARKS!P71,eMARKS!Q71*1.2)","v":0},{"$f":"IF(eSUBWAR!$I$21=\"Valid\",eMARKS!Q71,eMARKS!R71*1.2)","v":0},{"$f":"IF(eSUBWAR!$I$21=\"Valid\",eMARKS!R71,eMARKS!S71*1.2)","v":0},{"$f":"IF(eSUBWAR!$I$21=\"Valid\",eMARKS!S71,eMARKS!T71*1.2)","v":0},{"$f":"IF(eSUBWAR!$I$21=\"Valid\",eMARKS!T71,eMARKS!#REF!*0.8)","v":0}]
[{"$f":"eSPAR!A71","v":0},{"$f":"eSPAR!B71","v":0},{"$f":"IF(eSUBWAR!$I$21=\"Valid\",eMARKS!C72,eMARKS!D72*1.2)","v":0},{"$f":"IF(eSUBWAR!$I$21=\"Valid\",eMARKS!D72,eMARKS!E72*1.2)","v":0},{"$f":"IF(eSUBWAR!$I$21=\"Valid\",eMARKS!E72,eMARKS!F72*1.2)","v":0},{"$f":"IF(eSUBWAR!$I$21=\"Valid\",eMARKS!F72,eMARKS!G72*1.2)","v":0},{"$f":"IF(eSUBWAR!$I$21=\"Valid\",eMARKS!G72,eMARKS!H72*1.2)","v":0},{"$f":"IF(eSUBWAR!$I$21=\"Valid\",eMARKS!H72,eMARKS!#REF!*1.3)","v":0},null,null,null,null,{"$f":"IF(eSUBWAR!$I$21=\"Valid\",eMARKS!I72,eMARKS!J72*1.3)","v":0},{"$f":"IF(eSUBWAR!$I$21=\"Valid\",eMARKS!J72,eMARKS!K72*1.3)","v":0},{"$f":"IF(eSUBWAR!$I$21=\"Valid\",eMARKS!K72,eMARKS!L72*1.2)","v":0},{"$f":"IF(eSUBWAR!$I$21=\"Valid\",eMARKS!L72,eMARKS!M72*1.2)","v":0},{"$f":"IF(eSUBWAR!$I$21=\"Valid\",eMARKS!M72,eMARKS!N72*1.2)","v":0},{"$f":"IF(eSUBWAR!$I$21=\"Valid\",eMARKS!N72,eMARKS!#REF!*1.2)","v":0},null,null,null,null,{"$f":"IF(eSUBWAR!$I$21=\"Valid\",eMARKS!O72,eMARKS!P72*1.2)","v":0},{"$f":"IF(eSUBWAR!$I$21=\"Valid\",eMARKS!P72,eMARKS!Q72*1.2)","v":0},{"$f":"IF(eSUBWAR!$I$21=\"Valid\",eMARKS!Q72,eMARKS!R72*1.2)","v":0},{"$f":"IF(eSUBWAR!$I$21=\"Valid\",eMARKS!R72,eMARKS!S72*1.2)","v":0},{"$f":"IF(eSUBWAR!$I$21=\"Valid\",eMARKS!S72,eMARKS!T72*1.2)","v":0},{"$f":"IF(eSUBWAR!$I$21=\"Valid\",eMARKS!T72,eMARKS!#REF!*0.8)","v":0}]
[{"$f":"eSPAR!A72","v":0},{"$f":"eSPAR!B72","v":0},{"$f":"IF(eSUBWAR!$I$21=\"Valid\",eMARKS!C73,eMARKS!D73*1.2)","v":0},{"$f":"IF(eSUBWAR!$I$21=\"Valid\",eMARKS!D73,eMARKS!E73*1.2)","v":0},{"$f":"IF(eSUBWAR!$I$21=\"Valid\",eMARKS!E73,eMARKS!F73*1.2)","v":0},{"$f":"IF(eSUBWAR!$I$21=\"Valid\",eMARKS!F73,eMARKS!G73*1.2)","v":0},{"$f":"IF(eSUBWAR!$I$21=\"Valid\",eMARKS!G73,eMARKS!H73*1.2)","v":0},{"$f":"IF(eSUBWAR!$I$21=\"Valid\",eMARKS!H73,eMARKS!#REF!*1.3)","v":0},null,null,null,null,{"$f":"IF(eSUBWAR!$I$21=\"Valid\",eMARKS!I73,eMARKS!J73*1.3)","v":0},{"$f":"IF(eSUBWAR!$I$21=\"Valid\",eMARKS!J73,eMARKS!K73*1.3)","v":0},{"$f":"IF(eSUBWAR!$I$21=\"Valid\",eMARKS!K73,eMARKS!L73*1.2)","v":0},{"$f":"IF(eSUBWAR!$I$21=\"Valid\",eMARKS!L73,eMARKS!M73*1.2)","v":0},{"$f":"IF(eSUBWAR!$I$21=\"Valid\",eMARKS!M73,eMARKS!N73*1.2)","v":0},{"$f":"IF(eSUBWAR!$I$21=\"Valid\",eMARKS!N73,eMARKS!#REF!*1.2)","v":0},null,null,null,null,{"$f":"IF(eSUBWAR!$I$21=\"Valid\",eMARKS!O73,eMARKS!P73*1.2)","v":0},{"$f":"IF(eSUBWAR!$I$21=\"Valid\",eMARKS!P73,eMARKS!Q73*1.2)","v":0},{"$f":"IF(eSUBWAR!$I$21=\"Valid\",eMARKS!Q73,eMARKS!R73*1.2)","v":0},{"$f":"IF(eSUBWAR!$I$21=\"Valid\",eMARKS!R73,eMARKS!S73*1.2)","v":0},{"$f":"IF(eSUBWAR!$I$21=\"Valid\",eMARKS!S73,eMARKS!T73*1.2)","v":0},{"$f":"IF(eSUBWAR!$I$21=\"Valid\",eMARKS!T73,eMARKS!#REF!*0.8)","v":0}]
[{"$f":"eSPAR!A73","v":0},{"$f":"eSPAR!B73","v":0},{"$f":"IF(eSUBWAR!$I$21=\"Valid\",eMARKS!C74,eMARKS!D74*1.2)","v":0},{"$f":"IF(eSUBWAR!$I$21=\"Valid\",eMARKS!D74,eMARKS!E74*1.2)","v":0},{"$f":"IF(eSUBWAR!$I$21=\"Valid\",eMARKS!E74,eMARKS!F74*1.2)","v":0},{"$f":"IF(eSUBWAR!$I$21=\"Valid\",eMARKS!F74,eMARKS!G74*1.2)","v":0},{"$f":"IF(eSUBWAR!$I$21=\"Valid\",eMARKS!G74,eMARKS!H74*1.2)","v":0},{"$f":"IF(eSUBWAR!$I$21=\"Valid\",eMARKS!H74,eMARKS!#REF!*1.2)","v":0},null,null,null,null,{"$f":"IF(eSUBWAR!$I$21=\"Valid\",eMARKS!I74,eMARKS!J74*1.2)","v":0},{"$f":"IF(eSUBWAR!$I$21=\"Valid\",eMARKS!J74,eMARKS!K74*1.2)","v":0},{"$f":"IF(eSUBWAR!$I$21=\"Valid\",eMARKS!K74,eMARKS!L74*1.2)","v":0},{"$f":"IF(eSUBWAR!$I$21=\"Valid\",eMARKS!L74,eMARKS!M74*1.2)","v":0},{"$f":"IF(eSUBWAR!$I$21=\"Valid\",eMARKS!M74,eMARKS!N74*1.2)","v":0},{"$f":"IF(eSUBWAR!$I$21=\"Valid\",eMARKS!N74,eMARKS!#REF!*1.2)","v":0},null,null,null,null,{"$f":"IF(eSUBWAR!$I$21=\"Valid\",eMARKS!O74,eMARKS!P74*1.2)","v":0},{"$f":"IF(eSUBWAR!$I$21=\"Valid\",eMARKS!P74,eMARKS!Q74*1.2)","v":0},{"$f":"IF(eSUBWAR!$I$21=\"Valid\",eMARKS!Q74,eMARKS!R74*1.2)","v":0},{"$f":"IF(eSUBWAR!$I$21=\"Valid\",eMARKS!R74,eMARKS!S74*1.2)","v":0},{"$f":"IF(eSUBWAR!$I$21=\"Valid\",eMARKS!S74,eMARKS!T74*1.2)","v":0},{"$f":"IF(eSUBWAR!$I$21=\"Valid\",eMARKS!T74,eMARKS!#REF!*1.2)","v":0}]
[{"$f":"eSPAR!A74","v":0},{"$f":"eSPAR!B74","v":0},{"$f":"IF(eSUBWAR!$I$21=\"Valid\",eMARKS!C75,eMARKS!D75*1.2)","v":0},{"$f":"IF(eSUBWAR!$I$21=\"Valid\",eMARKS!D75,eMARKS!E75*1.2)","v":0},{"$f":"IF(eSUBWAR!$I$21=\"Valid\",eMARKS!E75,eMARKS!F75*1.2)","v":0},{"$f":"IF(eSUBWAR!$I$21=\"Valid\",eMARKS!F75,eMARKS!G75*1.2)","v":0},{"$f":"IF(eSUBWAR!$I$21=\"Valid\",eMARKS!G75,eMARKS!H75*1.2)","v":0},{"$f":"IF(eSUBWAR!$I$21=\"Valid\",eMARKS!H75,eMARKS!#REF!*1.2)","v":0},null,null,null,null,{"$f":"IF(eSUBWAR!$I$21=\"Valid\",eMARKS!I75,eMARKS!J75*1.2)","v":0},{"$f":"IF(eSUBWAR!$I$21=\"Valid\",eMARKS!J75,eMARKS!K75*1.2)","v":0},{"$f":"IF(eSUBWAR!$I$21=\"Valid\",eMARKS!K75,eMARKS!L75*1.2)","v":0},{"$f":"IF(eSUBWAR!$I$21=\"Valid\",eMARKS!L75,eMARKS!M75*1.2)","v":0},{"$f":"IF(eSUBWAR!$I$21=\"Valid\",eMARKS!M75,eMARKS!N75*1.2)","v":0},{"$f":"IF(eSUBWAR!$I$21=\"Valid\",eMARKS!N75,eMARKS!#REF!*1.2)","v":0},null,null,null,null,{"$f":"IF(eSUBWAR!$I$21=\"Valid\",eMARKS!O75,eMARKS!P75*1.2)","v":0},{"$f":"IF(eSUBWAR!$I$21=\"Valid\",eMARKS!P75,eMARKS!Q75*1.2)","v":0},{"$f":"IF(eSUBWAR!$I$21=\"Valid\",eMARKS!Q75,eMARKS!R75*1.2)","v":0},{"$f":"IF(eSUBWAR!$I$21=\"Valid\",eMARKS!R75,eMARKS!S75*1.2)","v":0},{"$f":"IF(eSUBWAR!$I$21=\"Valid\",eMARKS!S75,eMARKS!T75*1.2)","v":0},{"$f":"IF(eSUBWAR!$I$21=\"Valid\",eMARKS!T75,eMARKS!#REF!*1.2)","v":0}]
[{"$f":"eSPAR!A75","v":0},{"$f":"eSPAR!B75","v":0},{"$f":"IF(eSUBWAR!$I$21=\"Valid\",eMARKS!C76,eMARKS!D76*1.2)","v":0},{"$f":"IF(eSUBWAR!$I$21=\"Valid\",eMARKS!D76,eMARKS!E76*1.2)","v":0},{"$f":"IF(eSUBWAR!$I$21=\"Valid\",eMARKS!E76,eMARKS!F76*1.2)","v":0},{"$f":"IF(eSUBWAR!$I$21=\"Valid\",eMARKS!F76,eMARKS!G76*1.2)","v":0},{"$f":"IF(eSUBWAR!$I$21=\"Valid\",eMARKS!G76,eMARKS!H76*1.2)","v":0},{"$f":"IF(eSUBWAR!$I$21=\"Valid\",eMARKS!H76,eMARKS!#REF!*1.2)","v":0},null,null,null,null,{"$f":"IF(eSUBWAR!$I$21=\"Valid\",eMARKS!I76,eMARKS!J76*1.2)","v":0},{"$f":"IF(eSUBWAR!$I$21=\"Valid\",eMARKS!J76,eMARKS!K76*1.2)","v":0},{"$f":"IF(eSUBWAR!$I$21=\"Valid\",eMARKS!K76,eMARKS!L76*1.2)","v":0},{"$f":"IF(eSUBWAR!$I$21=\"Valid\",eMARKS!L76,eMARKS!M76*1.2)","v":0},{"$f":"IF(eSUBWAR!$I$21=\"Valid\",eMARKS!M76,eMARKS!N76*1.2)","v":0},{"$f":"IF(eSUBWAR!$I$21=\"Valid\",eMARKS!N76,eMARKS!#REF!*1.2)","v":0},null,null,null,null,{"$f":"IF(eSUBWAR!$I$21=\"Valid\",eMARKS!O76,eMARKS!P76*1.2)","v":0},{"$f":"IF(eSUBWAR!$I$21=\"Valid\",eMARKS!P76,eMARKS!Q76*1.2)","v":0},{"$f":"IF(eSUBWAR!$I$21=\"Valid\",eMARKS!Q76,eMARKS!R76*1.2)","v":0},{"$f":"IF(eSUBWAR!$I$21=\"Valid\",eMARKS!R76,eMARKS!S76*1.2)","v":0},{"$f":"IF(eSUBWAR!$I$21=\"Valid\",eMARKS!S76,eMARKS!T76*1.2)","v":0},{"$f":"IF(eSUBWAR!$I$21=\"Valid\",eMARKS!T76,eMARKS!#REF!*1.2)","v":0}]
[{"$f":"eSPAR!A76","v":0},{"$f":"eSPAR!B76","v":0},{"$f":"IF(eSUBWAR!$I$21=\"Valid\",eMARKS!C77,eMARKS!D77*1.2)","v":0},{"$f":"IF(eSUBWAR!$I$21=\"Valid\",eMARKS!D77,eMARKS!E77*1.2)","v":0},{"$f":"IF(eSUBWAR!$I$21=\"Valid\",eMARKS!E77,eMARKS!F77*1.2)","v":0},{"$f":"IF(eSUBWAR!$I$21=\"Valid\",eMARKS!F77,eMARKS!G77*1.2)","v":0},{"$f":"IF(eSUBWAR!$I$21=\"Valid\",eMARKS!G77,eMARKS!H77*1.2)","v":0},{"$f":"IF(eSUBWAR!$I$21=\"Valid\",eMARKS!H77,eMARKS!#REF!*1.2)","v":0},null,null,null,null,{"$f":"IF(eSUBWAR!$I$21=\"Valid\",eMARKS!I77,eMARKS!J77*1.2)","v":0},{"$f":"IF(eSUBWAR!$I$21=\"Valid\",eMARKS!J77,eMARKS!K77*1.2)","v":0},{"$f":"IF(eSUBWAR!$I$21=\"Valid\",eMARKS!K77,eMARKS!L77*1.2)","v":0},{"$f":"IF(eSUBWAR!$I$21=\"Valid\",eMARKS!L77,eMARKS!M77*1.2)","v":0},{"$f":"IF(eSUBWAR!$I$21=\"Valid\",eMARKS!M77,eMARKS!N77*1.2)","v":0},{"$f":"IF(eSUBWAR!$I$21=\"Valid\",eMARKS!N77,eMARKS!#REF!*1.2)","v":0},null,null,null,null,{"$f":"IF(eSUBWAR!$I$21=\"Valid\",eMARKS!O77,eMARKS!P77*1.2)","v":0},{"$f":"IF(eSUBWAR!$I$21=\"Valid\",eMARKS!P77,eMARKS!Q77*1.2)","v":0},{"$f":"IF(eSUBWAR!$I$21=\"Valid\",eMARKS!Q77,eMARKS!R77*1.2)","v":0},{"$f":"IF(eSUBWAR!$I$21=\"Valid\",eMARKS!R77,eMARKS!S77*1.2)","v":0},{"$f":"IF(eSUBWAR!$I$21=\"Valid\",eMARKS!S77,eMARKS!T77*1.2)","v":0},{"$f":"IF(eSUBWAR!$I$21=\"Valid\",eMARKS!T77,eMARKS!#REF!*1.2)","v":0}]
[{"$f":"eSPAR!A77","v":0},{"$f":"eSPAR!B77","v":0},{"$f":"IF(eSUBWAR!$I$21=\"Valid\",eMARKS!C78,eMARKS!D78*1.2)","v":0},{"$f":"IF(eSUBWAR!$I$21=\"Valid\",eMARKS!D78,eMARKS!E78*1.2)","v":0},{"$f":"IF(eSUBWAR!$I$21=\"Valid\",eMARKS!E78,eMARKS!F78*1.2)","v":0},{"$f":"IF(eSUBWAR!$I$21=\"Valid\",eMARKS!F78,eMARKS!G78*1.2)","v":0},{"$f":"IF(eSUBWAR!$I$21=\"Valid\",eMARKS!G78,eMARKS!H78*1.2)","v":0},{"$f":"IF(eSUBWAR!$I$21=\"Valid\",eMARKS!H78,eMARKS!#REF!*1.2)","v":0},null,null,null,null,{"$f":"IF(eSUBWAR!$I$21=\"Valid\",eMARKS!I78,eMARKS!J78*1.2)","v":0},{"$f":"IF(eSUBWAR!$I$21=\"Valid\",eMARKS!J78,eMARKS!K78*1.2)","v":0},{"$f":"IF(eSUBWAR!$I$21=\"Valid\",eMARKS!K78,eMARKS!L78*1.2)","v":0},{"$f":"IF(eSUBWAR!$I$21=\"Valid\",eMARKS!L78,eMARKS!M78*1.2)","v":0},{"$f":"IF(eSUBWAR!$I$21=\"Valid\",eMARKS!M78,eMARKS!N78*1.2)","v":0},{"$f":"IF(eSUBWAR!$I$21=\"Valid\",eMARKS!N78,eMARKS!#REF!*1.2)","v":0},null,null,null,null,{"$f":"IF(eSUBWAR!$I$21=\"Valid\",eMARKS!O78,eMARKS!P78*1.2)","v":0},{"$f":"IF(eSUBWAR!$I$21=\"Valid\",eMARKS!P78,eMARKS!Q78*1.2)","v":0},{"$f":"IF(eSUBWAR!$I$21=\"Valid\",eMARKS!Q78,eMARKS!R78*1.2)","v":0},{"$f":"IF(eSUBWAR!$I$21=\"Valid\",eMARKS!R78,eMARKS!S78*1.2)","v":0},{"$f":"IF(eSUBWAR!$I$21=\"Valid\",eMARKS!S78,eMARKS!T78*1.2)","v":0},{"$f":"IF(eSUBWAR!$I$21=\"Valid\",eMARKS!T78,eMARKS!#REF!*1.2)","v":0}]
[{"$f":"eSPAR!A78","v":0},{"$f":"eSPAR!B78","v":0},{"$f":"IF(eSUBWAR!$I$21=\"Valid\",eMARKS!C79,eMARKS!D79*1.2)","v":0},{"$f":"IF(eSUBWAR!$I$21=\"Valid\",eMARKS!D79,eMARKS!E79*1.2)","v":0},{"$f":"IF(eSUBWAR!$I$21=\"Valid\",eMARKS!E79,eMARKS!F79*1.2)","v":0},{"$f":"IF(eSUBWAR!$I$21=\"Valid\",eMARKS!F79,eMARKS!G79*1.2)","v":0},{"$f":"IF(eSUBWAR!$I$21=\"Valid\",eMARKS!G79,eMARKS!H79*1.2)","v":0},{"$f":"IF(eSUBWAR!$I$21=\"Valid\",eMARKS!H79,eMARKS!#REF!*1.2)","v":0},null,null,null,null,{"$f":"IF(eSUBWAR!$I$21=\"Valid\",eMARKS!I79,eMARKS!J79*1.2)","v":0},{"$f":"IF(eSUBWAR!$I$21=\"Valid\",eMARKS!J79,eMARKS!K79*1.3)","v":0},{"$f":"IF(eSUBWAR!$I$21=\"Valid\",eMARKS!K79,eMARKS!L79*1.3)","v":0},{"$f":"IF(eSUBWAR!$I$21=\"Valid\",eMARKS!L79,eMARKS!M79*1.3)","v":0},{"$f":"IF(eSUBWAR!$I$21=\"Valid\",eMARKS!M79,eMARKS!N79*1.3)","v":0},{"$f":"IF(eSUBWAR!$I$21=\"Valid\",eMARKS!N79,eMARKS!#REF!*1.3)","v":0},null,null,null,null,{"$f":"IF(eSUBWAR!$I$21=\"Valid\",eMARKS!O79,eMARKS!P79*1.2)","v":0},{"$f":"IF(eSUBWAR!$I$21=\"Valid\",eMARKS!P79,eMARKS!Q79*1.2)","v":0},{"$f":"IF(eSUBWAR!$I$21=\"Valid\",eMARKS!Q79,eMARKS!R79*1.2)","v":0},{"$f":"IF(eSUBWAR!$I$21=\"Valid\",eMARKS!R79,eMARKS!S79*1.2)","v":0},{"$f":"IF(eSUBWAR!$I$21=\"Valid\",eMARKS!S79,eMARKS!T79*1.2)","v":0},{"$f":"IF(eSUBWAR!$I$21=\"Valid\",eMARKS!T79,eMARKS!#REF!*1.2)","v":0}]
[{"$f":"eSPAR!A79","v":0},{"$f":"eSPAR!B79","v":0},{"$f":"IF(eSUBWAR!$I$21=\"Valid\",eMARKS!C80,eMARKS!D80*1.2)","v":0},{"$f":"IF(eSUBWAR!$I$21=\"Valid\",eMARKS!D80,eMARKS!E80*1.2)","v":0},{"$f":"IF(eSUBWAR!$I$21=\"Valid\",eMARKS!E80,eMARKS!F80*1.2)","v":0},{"$f":"IF(eSUBWAR!$I$21=\"Valid\",eMARKS!F80,eMARKS!G80*1.2)","v":0},{"$f":"IF(eSUBWAR!$I$21=\"Valid\",eMARKS!G80,eMARKS!H80*1.2)","v":0},{"$f":"IF(eSUBWAR!$I$21=\"Valid\",eMARKS!H80,eMARKS!#REF!*1.7)","v":0},null,null,null,null,{"$f":"IF(eSUBWAR!$I$21=\"Valid\",eMARKS!I80,eMARKS!J80*1.7)","v":0},{"$f":"IF(eSUBWAR!$I$21=\"Valid\",eMARKS!J80,eMARKS!K80*1.3)","v":0},{"$f":"IF(eSUBWAR!$I$21=\"Valid\",eMARKS!K80,eMARKS!L80*1.3)","v":0},{"$f":"IF(eSUBWAR!$I$21=\"Valid\",eMARKS!L80,eMARKS!M80*1.3)","v":0},{"$f":"IF(eSUBWAR!$I$21=\"Valid\",eMARKS!M80,eMARKS!N80*1.3)","v":0},{"$f":"IF(eSUBWAR!$I$21=\"Valid\",eMARKS!N80,eMARKS!#REF!*1.3)","v":0},null,null,null,null,{"$f":"IF(eSUBWAR!$I$21=\"Valid\",eMARKS!O80,eMARKS!P80*1.2)","v":0},{"$f":"IF(eSUBWAR!$I$21=\"Valid\",eMARKS!P80,eMARKS!Q80*1.2)","v":0},{"$f":"IF(eSUBWAR!$I$21=\"Valid\",eMARKS!Q80,eMARKS!R80*1.7)","v":0},{"$f":"IF(eSUBWAR!$I$21=\"Valid\",eMARKS!R80,eMARKS!S80*1.7)","v":0},{"$f":"IF(eSUBWAR!$I$21=\"Valid\",eMARKS!S80,eMARKS!T80*1.7)","v":0},{"$f":"IF(eSUBWAR!$I$21=\"Valid\",eMARKS!T80,eMARKS!#REF!*1.7)","v":0}]
[{"$f":"eSPAR!A80","v":0},{"$f":"eSPAR!B80","v":0},{"$f":"IF(eSUBWAR!$I$21=\"Valid\",eMARKS!C81,eMARKS!D81*1.2)","v":0},{"$f":"IF(eSUBWAR!$I$21=\"Valid\",eMARKS!D81,eMARKS!E81*1.2)","v":0},{"$f":"IF(eSUBWAR!$I$21=\"Valid\",eMARKS!E81,eMARKS!F81*1.2)","v":0},{"$f":"IF(eSUBWAR!$I$21=\"Valid\",eMARKS!F81,eMARKS!G81*1.2)","v":0},{"$f":"IF(eSUBWAR!$I$21=\"Valid\",eMARKS!G81,eMARKS!H81*1.2)","v":0},{"$f":"IF(eSUBWAR!$I$21=\"Valid\",eMARKS!H81,eMARKS!#REF!*1.7)","v":0},null,null,null,null,{"$f":"IF(eSUBWAR!$I$21=\"Valid\",eMARKS!I81,eMARKS!J81*0.8)","v":0},{"$f":"IF(eSUBWAR!$I$21=\"Valid\",eMARKS!J81,eMARKS!K81*1.3)","v":0},{"$f":"IF(eSUBWAR!$I$21=\"Valid\",eMARKS!K81,eMARKS!L81*1.3)","v":0},{"$f":"IF(eSUBWAR!$I$21=\"Valid\",eMARKS!L81,eMARKS!M81*1.3)","v":0},{"$f":"IF(eSUBWAR!$I$21=\"Valid\",eMARKS!M81,eMARKS!N81*1.3)","v":0},{"$f":"IF(eSUBWAR!$I$21=\"Valid\",eMARKS!N81,eMARKS!#REF!*1.3)","v":0},null,null,null,null,{"$f":"IF(eSUBWAR!$I$21=\"Valid\",eMARKS!O81,eMARKS!P81*0.8)","v":0},{"$f":"IF(eSUBWAR!$I$21=\"Valid\",eMARKS!P81,eMARKS!Q81*0.8)","v":0},{"$f":"IF(eSUBWAR!$I$21=\"Valid\",eMARKS!Q81,eMARKS!R81*0.8)","v":0},{"$f":"IF(eSUBWAR!$I$21=\"Valid\",eMARKS!R81,eMARKS!S81*0.8)","v":0},{"$f":"IF(eSUBWAR!$I$21=\"Valid\",eMARKS!S81,eMARKS!T81*0.8)","v":0},{"$f":"IF(eSUBWAR!$I$21=\"Valid\",eMARKS!T81,eMARKS!#REF!*0.8)","v":0}]
[{"$f":"eSPAR!A81","v":0},{"$f":"eSPAR!B81","v":0},{"$f":"IF(eSUBWAR!$I$21=\"Valid\",eMARKS!C82,eMARKS!D82*1.2)","v":0},{"$f":"IF(eSUBWAR!$I$21=\"Valid\",eMARKS!D82,eMARKS!E82*1.2)","v":0},{"$f":"IF(eSUBWAR!$I$21=\"Valid\",eMARKS!E82,eMARKS!F82*1.2)","v":0},{"$f":"IF(eSUBWAR!$I$21=\"Valid\",eMARKS!F82,eMARKS!G82*1.2)","v":0},{"$f":"IF(eSUBWAR!$I$21=\"Valid\",eMARKS!G82,eMARKS!H82*1.2)","v":0},{"$f":"IF(eSUBWAR!$I$21=\"Valid\",eMARKS!H82,eMARKS!#REF!*1.7)","v":0},null,null,null,null,{"$f":"IF(eSUBWAR!$I$21=\"Valid\",eMARKS!I82,eMARKS!J82*0.8)","v":0},{"$f":"IF(eSUBWAR!$I$21=\"Valid\",eMARKS!J82,eMARKS!K82*1.3)","v":0},{"$f":"IF(eSUBWAR!$I$21=\"Valid\",eMARKS!K82,eMARKS!L82*1.3)","v":0},{"$f":"IF(eSUBWAR!$I$21=\"Valid\",eMARKS!L82,eMARKS!M82*1.3)","v":0},{"$f":"IF(eSUBWAR!$I$21=\"Valid\",eMARKS!M82,eMARKS!N82*1.3)","v":0},{"$f":"IF(eSUBWAR!$I$21=\"Valid\",eMARKS!N82,eMARKS!#REF!*1.3)","v":0},null,null,null,null,{"$f":"IF(eSUBWAR!$I$21=\"Valid\",eMARKS!O82,eMARKS!P82*0.8)","v":0},{"$f":"IF(eSUBWAR!$I$21=\"Valid\",eMARKS!P82,eMARKS!Q82*0.8)","v":0},{"$f":"IF(eSUBWAR!$I$21=\"Valid\",eMARKS!Q82,eMARKS!R82*0.8)","v":0},{"$f":"IF(eSUBWAR!$I$21=\"Valid\",eMARKS!R82,eMARKS!S82*0.8)","v":0},{"$f":"IF(eSUBWAR!$I$21=\"Valid\",eMARKS!S82,eMARKS!T82*0.8)","v":0},{"$f":"IF(eSUBWAR!$I$21=\"Valid\",eMARKS!T82,eMARKS!#REF!*0.8)","v":0}]
[{"$f":"eSPAR!A82","v":0},{"$f":"eSPAR!B82","v":0},{"$f":"IF(eSUBWAR!$I$21=\"Valid\",eMARKS!C83,eMARKS!D83*1.2)","v":0},{"$f":"IF(eSUBWAR!$I$21=\"Valid\",eMARKS!D83,eMARKS!E83*1.2)","v":0},{"$f":"IF(eSUBWAR!$I$21=\"Valid\",eMARKS!E83,eMARKS!F83*1.2)","v":0},{"$f":"IF(eSUBWAR!$I$21=\"Valid\",eMARKS!F83,eMARKS!G83*1.2)","v":0},{"$f":"IF(eSUBWAR!$I$21=\"Valid\",eMARKS!G83,eMARKS!H83*1.2)","v":0},{"$f":"IF(eSUBWAR!$I$21=\"Valid\",eMARKS!H83,eMARKS!#REF!*1.7)","v":0},null,null,null,null,{"$f":"IF(eSUBWAR!$I$21=\"Valid\",eMARKS!I83,eMARKS!J83*1.7)","v":0},{"$f":"IF(eSUBWAR!$I$21=\"Valid\",eMARKS!J83,eMARKS!K83*1.3)","v":0},{"$f":"IF(eSUBWAR!$I$21=\"Valid\",eMARKS!K83,eMARKS!L83*1.3)","v":0},{"$f":"IF(eSUBWAR!$I$21=\"Valid\",eMARKS!L83,eMARKS!M83*1.3)","v":0},{"$f":"IF(eSUBWAR!$I$21=\"Valid\",eMARKS!M83,eMARKS!N83*1.3)","v":0},{"$f":"IF(eSUBWAR!$I$21=\"Valid\",eMARKS!N83,eMARKS!#REF!*1.3)","v":0},null,null,null,null,{"$f":"IF(eSUBWAR!$I$21=\"Valid\",eMARKS!O83,eMARKS!P83*1.2)","v":0},{"$f":"IF(eSUBWAR!$I$21=\"Valid\",eMARKS!P83,eMARKS!Q83*1.2)","v":0},{"$f":"IF(eSUBWAR!$I$21=\"Valid\",eMARKS!Q83,eMARKS!R83*1.2)","v":0},{"$f":"IF(eSUBWAR!$I$21=\"Valid\",eMARKS!R83,eMARKS!S83*1.2)","v":0},{"$f":"IF(eSUBWAR!$I$21=\"Valid\",eMARKS!S83,eMARKS!T83*1.2)","v":0},{"$f":"IF(eSUBWAR!$I$21=\"Valid\",eMARKS!T83,eMARKS!#REF!*1.2)","v":0}]
[{"$f":"eSPAR!A83","v":0},{"$f":"eSPAR!B83","v":0},{"$f":"IF(eSUBWAR!$I$21=\"Valid\",eMARKS!C84,eMARKS!D84*1.2)","v":0},{"$f":"IF(eSUBWAR!$I$21=\"Valid\",eMARKS!D84,eMARKS!E84*1.2)","v":0},{"$f":"IF(eSUBWAR!$I$21=\"Valid\",eMARKS!E84,eMARKS!F84*1.2)","v":0},{"$f":"IF(eSUBWAR!$I$21=\"Valid\",eMARKS!F84,eMARKS!G84*1.2)","v":0},{"$f":"IF(eSUBWAR!$I$21=\"Valid\",eMARKS!G84,eMARKS!H84*1.2)","v":0},{"$f":"IF(eSUBWAR!$I$21=\"Valid\",eMARKS!H84,eMARKS!#REF!*1.7)","v":0},null,null,null,null,{"$f":"IF(eSUBWAR!$I$21=\"Valid\",eMARKS!I84,eMARKS!J84*1.7)","v":0},{"$f":"IF(eSUBWAR!$I$21=\"Valid\",eMARKS!J84,eMARKS!K84*1.3)","v":0},{"$f":"IF(eSUBWAR!$I$21=\"Valid\",eMARKS!K84,eMARKS!L84*1.3)","v":0},{"$f":"IF(eSUBWAR!$I$21=\"Valid\",eMARKS!L84,eMARKS!M84*1.3)","v":0},{"$f":"IF(eSUBWAR!$I$21=\"Valid\",eMARKS!M84,eMARKS!N84*1.3)","v":0},{"$f":"IF(eSUBWAR!$I$21=\"Valid\",eMARKS!N84,eMARKS!#REF!*1.3)","v":0},null,null,null,null,{"$f":"IF(eSUBWAR!$I$21=\"Valid\",eMARKS!O84,eMARKS!P84*1.2)","v":0},{"$f":"IF(eSUBWAR!$I$21=\"Valid\",eMARKS!P84,eMARKS!Q84*1.2)","v":0},{"$f":"IF(eSUBWAR!$I$21=\"Valid\",eMARKS!Q84,eMARKS!R84*1.2)","v":0},{"$f":"IF(eSUBWAR!$I$21=\"Valid\",eMARKS!R84,eMARKS!S84*1.2)","v":0},{"$f":"IF(eSUBWAR!$I$21=\"Valid\",eMARKS!S84,eMARKS!T84*1.2)","v":0},{"$f":"IF(eSUBWAR!$I$21=\"Valid\",eMARKS!T84,eMARKS!#REF!*1.2)","v":0}]
[{"$f":"eSPAR!A84","v":0},{"$f":"eSPAR!B84","v":0},{"$f":"IF(eSUBWAR!$I$21=\"Valid\",eMARKS!C85,eMARKS!D85*1.2)","v":0},{"$f":"IF(eSUBWAR!$I$21=\"Valid\",eMARKS!D85,eMARKS!E85*1.2)","v":0},{"$f":"IF(eSUBWAR!$I$21=\"Valid\",eMARKS!E85,eMARKS!F85*1.2)","v":0},{"$f":"IF(eSUBWAR!$I$21=\"Valid\",eMARKS!F85,eMARKS!G85*1.2)","v":0},{"$f":"IF(eSUBWAR!$I$21=\"Valid\",eMARKS!G85,eMARKS!H85*1.2)","v":0},{"$f":"IF(eSUBWAR!$I$21=\"Valid\",eMARKS!H85,eMARKS!#REF!*1.7)","v":0},null,null,null,null,{"$f":"IF(eSUBWAR!$I$21=\"Valid\",eMARKS!I85,eMARKS!J85*1.7)","v":0},{"$f":"IF(eSUBWAR!$I$21=\"Valid\",eMARKS!J85,eMARKS!K85*1.7)","v":0},{"$f":"IF(eSUBWAR!$I$21=\"Valid\",eMARKS!K85,eMARKS!L85*1.7)","v":0},{"$f":"IF(eSUBWAR!$I$21=\"Valid\",eMARKS!L85,eMARKS!M85*1.7)","v":0},{"$f":"IF(eSUBWAR!$I$21=\"Valid\",eMARKS!M85,eMARKS!N85*1.2)","v":0},{"$f":"IF(eSUBWAR!$I$21=\"Valid\",eMARKS!N85,eMARKS!#REF!*1.2)","v":0},null,null,null,null,{"$f":"IF(eSUBWAR!$I$21=\"Valid\",eMARKS!O85,eMARKS!P85*1.2)","v":0},{"$f":"IF(eSUBWAR!$I$21=\"Valid\",eMARKS!P85,eMARKS!Q85*1.2)","v":0},{"$f":"IF(eSUBWAR!$I$21=\"Valid\",eMARKS!Q85,eMARKS!R85*1.2)","v":0},{"$f":"IF(eSUBWAR!$I$21=\"Valid\",eMARKS!R85,eMARKS!S85*1.2)","v":0},{"$f":"IF(eSUBWAR!$I$21=\"Valid\",eMARKS!S85,eMARKS!T85*1.2)","v":0},{"$f":"IF(eSUBWAR!$I$21=\"Valid\",eMARKS!T85,eMARKS!#REF!*1.2)","v":0}]
[{"$f":"eSPAR!A85","v":0},{"$f":"eSPAR!B85","v":0},{"$f":"IF(eSUBWAR!$I$21=\"Valid\",eMARKS!C86,eMARKS!D86*1.2)","v":0},{"$f":"IF(eSUBWAR!$I$21=\"Valid\",eMARKS!D86,eMARKS!E86*1.2)","v":0},{"$f":"IF(eSUBWAR!$I$21=\"Valid\",eMARKS!E86,eMARKS!F86*1.2)","v":0},{"$f":"IF(eSUBWAR!$I$21=\"Valid\",eMARKS!F86,eMARKS!G86*1.2)","v":0},{"$f":"IF(eSUBWAR!$I$21=\"Valid\",eMARKS!G86,eMARKS!H86*1.2)","v":0},{"$f":"IF(eSUBWAR!$I$21=\"Valid\",eMARKS!H86,eMARKS!#REF!*1.2)","v":0},null,null,null,null,{"$f":"IF(eSUBWAR!$I$21=\"Valid\",eMARKS!I86,eMARKS!J86*1.2)","v":0},{"$f":"IF(eSUBWAR!$I$21=\"Valid\",eMARKS!J86,eMARKS!K86*1.2)","v":0},{"$f":"IF(eSUBWAR!$I$21=\"Valid\",eMARKS!K86,eMARKS!L86*1.2)","v":0},{"$f":"IF(eSUBWAR!$I$21=\"Valid\",eMARKS!L86,eMARKS!M86*1.2)","v":0},{"$f":"IF(eSUBWAR!$I$21=\"Valid\",eMARKS!M86,eMARKS!N86*1.2)","v":0},{"$f":"IF(eSUBWAR!$I$21=\"Valid\",eMARKS!N86,eMARKS!#REF!*1.2)","v":0},null,null,null,null,{"$f":"IF(eSUBWAR!$I$21=\"Valid\",eMARKS!O86,eMARKS!P86*1.2)","v":0},{"$f":"IF(eSUBWAR!$I$21=\"Valid\",eMARKS!P86,eMARKS!Q86*1.2)","v":0},{"$f":"IF(eSUBWAR!$I$21=\"Valid\",eMARKS!Q86,eMARKS!R86*1.2)","v":0},{"$f":"IF(eSUBWAR!$I$21=\"Valid\",eMARKS!R86,eMARKS!S86*1.2)","v":0},{"$f":"IF(eSUBWAR!$I$21=\"Valid\",eMARKS!S86,eMARKS!T86*1.2)","v":0},{"$f":"IF(eSUBWAR!$I$21=\"Valid\",eMARKS!T86,eMARKS!#REF!*1.2)","v":0}]

{"sheet":"PERCENTAGE2","index":2,"n_rows":86,"n_cols":32,"rows_kept":86,"cut":false,"hidden":true,"merged":[[5,22,5,31],[2,6,2,19],[0,0,0,19],[1,0,1,19],[5,2,5,11],[5,12,5,21]]}
[]
[{"$f":"Internal!B34","v":"Class : IX"}]
[]
["Roll No.","Name",null,null,null,null,null,null,"CC","X10",null,null,null,null,null,"DD",null,"X5",null,null,null,null,null,null,null,"EE",null,"X5"]
[null,null,1,2,3,4,5,6,7,8,9,10,1,2,3,4,5,6,7,8,9,10,1,2,3,4,5,6,7,8,9,10]
[null,null,"PT1",null,null,null,null,null,null,null,null,null,"PT2",null,null,null,null,null,null,null,null,null,"PT3"]
[{"$f":"eSPAR!A6","v":1},{"$f":"eSPAR!B6","v":"Aman Kumar"},{"$f":"PERCENTAGE!C7/eSUBMAR!$C$6*10","v":7},{"$f":"PERCENTAGE!D7/eSUBMAR!$C$7*10","v":6},{"$f":"PERCENTAGE!E7/eSUBMAR!$C$8*10","v":7},{"$f":"PERCENTAGE!F7/eSUBMAR!$C$9*10","v":8},{"$f":"PERCENTAGE!G7/eSUBMAR!$C$10*10","v":8},{"$f":"PERCENTAGE!H7/eSUBMAR!$C$11*10","v":5},null,null,null,null,{"$f":"PERCENTAGE!M7/eSUBMAR!$D$6*10","v":6},{"$f":"PERCENTAGE!N7/eSUBMAR!$D$7*10","v":7},{"$f":"PERCENTAGE!O7/eSUBMAR!$D$8*10","v":5},{"$f":"PERCENTAGE!P7/eSUBMAR!$D$9*10","v":6},{"$f":"PERCENTAGE!Q7/eSUBMAR!$D$10*10","v":5},{"$f":"PERCENTAGE!R7/eSUBMAR!$D$11*10","v":6},null,null,null,null,{"$f":"PERCENTAGE!W7/eSUBMAR!$E$6*10","v":7},{"$f":"PERCENTAGE!X7/eSUBMAR!$E$7*10","v":8},{"$f":"PERCENTAGE!Y7/eSUBMAR!$E$8*10","v":9},{"$f":"PERCENTAGE!Z7/eSUBMAR!$E$9*10","v":6},{"$f":"PERCENTAGE!AA7/eSUBMAR!$E$10*10","v":7},{"$f":"PERCENTAGE!AB7/eSUBMAR!$E$11*10","v":8}]
[{"$f":"eSPAR!A7","v":2},{"$f":"eSPAR!B7","v":0},{"$f":"PERCENTAGE!C8/eSUBMAR!$C$6*10","v":0},{"$f":"PERCENTAGE!D8/eSUBMAR!$C$7*10","v":0},{"$f":"PERCENTAGE!E8/eSUBMAR!$C$8*10","v":0},{"$f":"PERCENTAGE!F8/eSUBMAR!$C$9*10","v":0},{"$f":"PERCENTAGE!G8/eSUBMAR!$C$10*10","v":0},{"$f":"PERCENTAGE!H8/eSUBMAR!$C$11*10","v":0},null,null,null,null,{"$f":"PERCENTAGE!M8/eSUBMAR!$D$6*10","v":0},{"$f":"PERCENTAGE!N8/eSUBMAR!$D$7*10","v":0},{"$f":"PERCENTAGE!O8/eSUBMAR!$D$8*10","v":0},{"$f":"PERCENTAGE!P8/eSUBMAR!$D$9*10","v":0},{"$f":"PERCENTAGE!Q8/eSUBMAR!$D$10*10","v":0},{"$f":"PERCENTAGE!R8/eSUBMAR!$D$11*10","v":0},null,null,null,null,{"$f":"PERCENTAGE!W8/eSUBMAR!$E$6*10","v":0},{"$f":"PERCENTAGE!X8/eSUBMAR!$E$7*10","v":0},{"$f":"PERCENTAGE!Y8/eSUBMAR!$E$8*10","v":0},{"$f":"PERCENTAGE!Z8/eSUBMAR!$E$9*10","v":0},{"$f":"PERCENTAGE!AA8/eSUBMAR!$E$10*10","v":0},{"$f":"PERCENTAGE!AB8/eSUBMAR!$E$11*10","v":0}]
[{"$f":"eSPAR!A8","v":0},{"$f":"eSPAR!B8","v":0},{"$f":"PERCENTAGE!C9/eSUBMAR!$C$6*10","v":0},{"$f":"PERCENTAGE!D9/eSUBMAR!$C$7*10","v":0},{"$f":"PERCENTAGE!E9/eSUBMAR!$C$8*10","v":0},{"$f":"PERCENTAGE!F9/eSUBMAR!$C$9*10","v":0},{"$f":"PERCENTAGE!G9/eSUBMAR!$C$10*10","v":0},{"$f":"PERCENTAGE!H9/eSUBMAR!$C$11*10","v":0},null,null,null,null,{"$f":"PERCENTAGE!M9/eSUBMAR!$D$6*10","v":0},{"$f":"PERCENTAGE!N9/eSUBMAR!$D$7*10","v":0},{"$f":"PERCENTAGE!O9/eSUBMAR!$D$8*10","v":0},{"$f":"PERCENTAGE!P9/eSUBMAR!$D$9*10","v":0},{"$f":"PERCENTAGE!Q9/eSUBMAR!$D$10*10","v":0},{"$f":"PERCENTAGE!R9/eSUBMAR!$D$11*10","v":0},null,null,null,null,{"$f":"PERCENTAGE!W9/eSUBMAR!$E$6*10","v":0},{"$f":"PERCENTAGE!X9/eSUBMAR!$E$7*10","v":0},{"$f":"PERCENTAGE!Y9/eSUBMAR!$E$8*10","v":0},{"$f":"PERCENTAGE!Z9/eSUBMAR!$E$9*10","v":0},{"$f":"PERCENTAGE!AA9/eSUBMAR!$E$10*10","v":0},{"$f":"PERCENTAGE!AB9/eSUBMAR!$E$11*10","v":0}]
[{"$f":"eSPAR!A9","v":0},{"$f":"eSPAR!B9","v":0},{"$f":"PERCENTAGE!C10/eSUBMAR!$C$6*10","v":0},{"$f":"PERCENTAGE!D10/eSUBMAR!$C$7*10","v":0},{"$f":"PERCENTAGE!E10/eSUBMAR!$C$8*10","v":0},{"$f":"PERCENTAGE!F10/eSUBMAR!$C$9*10","v":0},{"$f":"PERCENTAGE!G10/eSUBMAR!$C$10*10","v":0},{"$f":"PERCENTAGE!H10/eSUBMAR!$C$11*10","v":0},null,null,null,null,{"$f":"PERCENTAGE!M10/eSUBMAR!$D$6*10","v":0},{"$f":"PERCENTAGE!N10/eSUBMAR!$D$7*10","v":0},{"$f":"PERCENTAGE!O10/eSUBMAR!$D$8*10","v":0},{"$f":"PERCENTAGE!P10/eSUBMAR!$D$9*10","v":0},{"$f":"PERCENTAGE!Q10/eSUBMAR!$D$10*10","v":0},{"$f":"PERCENTAGE!R10/eSUBMAR!$D$11*10","v":0},null,null,null,null,{"$f":"PERCENTAGE!W10/eSUBMAR!$E$6*10","v":0},{"$f":"PERCENTAGE!X10/eSUBMAR!$E$7*10","v":0},{"$f":"PERCENTAGE!Y10/eSUBMAR!$E$8*10","v":0},{"$f":"PERCENTAGE!Z10/eSUBMAR!$E$9*10","v":0},{"$f":"PERCENTAGE!AA10/eSUBMAR!$E$10*10","v":0},{"$f":"PERCENTAGE!AB10/eSUBMAR!$E$11*10","v":0}]
[{"$f":"eSPAR!A10","v":0},{"$f":"eSPAR!B10","v":0},{"$f":"PERCENTAGE!C11/eSUBMAR!$C$6*10","v":0},{"$f":"PERCENTAGE!D11/eSUBMAR!$C$7*10","v":0},{"$f":"PERCENTAGE!E11/eSUBMAR!$C$8*10","v":0},{"$f":"PERCENTAGE!F11/eSUBMAR!$C$9*10","v":0},{"$f":"PERCENTAGE!G11/eSUBMAR!$C$10*10","v":0},{"$f":"PERCENTAGE!H11/eSUBMAR!$C$11*10","v":0},null,null,null,null,{"$f":"PERCENTAGE!M11/eSUBMAR!$D$6*10","v":0},{"$f":"PERCENTAGE!N11/eSUBMAR!$D$7*10","v":0},{"$f":"PERCENTAGE!O11/eSUBMAR!$D$8*10","v":0},{"$f":"PERCENTAGE!P11/eSUBMAR!$D$9*10","v":0},{"$f":"PERCENTAGE!Q11/eSUBMAR!$D$10*10","v":0},{"$f":"PERCENTAGE!R11/eSUBMAR!$D$11*10","v":0},null,null,null,null,{"$f":"PERCENTAGE!W11/eSUBMAR!$E$6*10","v":0},{"$f":"PERCENTAGE!X11/eSUBMAR!$E$7*10","v":0},{"$f":"PERCENTAGE!Y11/eSUBMAR!$E$8*10","v":0},{"$f":"PERCENTAGE!Z11/eSUBMAR!$E$9*10","v":0},{"$f":"PERCENTAGE!AA11/eSUBMAR!$E$10*10","v":0},{"$f":"PERCENTAGE!AB11/eSUBMAR!$E$11*10","v":0}]
[{"$f":"eSPAR!A11","v":0},{"$f":"eSPAR!B11","v":0},{"$f":"PERCENTAGE!C12/eSUBMAR!$C$6*10","v":0},{"$f":"PERCENTAGE!D12/eSUBMAR!$C$7*10","v":0},{"$f":"PERCENTAGE!E12/eSUBMAR!$C$8*10","v":0},{"$f":"PERCENTAGE!F12/eSUBMAR!$C$9*10","v":0},{"$f":"PERCENTAGE!G12/eSUBMAR!$C$10*10","v":0},{"$f":"PERCENTAGE!H12/eSUBMAR!$C$11*10","v":0},null,null,null,null,{"$f":"PERCENTAGE!M12/eSUBMAR!$D$6*10","v":0},{"$f":"PERCENTAGE!N12/eSUBMAR!$D$7*10","v":0},{"$f":"PERCENTAGE!O12/eSUBMAR!$D$8*10","v":0},{"$f":"PERCENTAGE!P12/eSUBMAR!$D$9*10","v":0},{"$f":"PERCENTAGE!Q12/eSUBMAR!$D$10*10","v":0},{"$f":"PERCENTAGE!R12/eSUBMAR!$D$11*10","v":0},null,null,null,null,{"$f":"PERCENTAGE!W12/eSUBMAR!$E$6*10","v":0},{"$f":"PERCENTAGE!X12/eSUBMAR!$E$7*10","v":0},{"$f":"PERCENTAGE!Y12/eSUBMAR!$E$8*10","v":0},{"$f":"PERCENTAGE!Z12/eSUBMAR!$E$9*10","v":0},{"$f":"PERCENTAGE!AA12/eSUBMAR!$E$10*10","v":0},{"$f":"PERCENTAGE!AB12/eSUBMAR!$E$11*10","v":0}]
[{"$f":"eSPAR!A12","v":0},{"$f":"eSPAR!B12","v":0},{"$f":"PERCENTAGE!C13/eSUBMAR!$C$6*10","v":0},{"$f":"PERCENTAGE!D13/eSUBMAR!$C$7*10","v":0},{"$f":"PERCENTAGE!E13/eSUBMAR!$C$8*10","v":0},{"$f":"PERCENTAGE!F13/eSUBMAR!$C$9*10","v":0},{"$f":"PERCENTAGE!G13/eSUBMAR!$C$10*10","v":0},{"$f":"PERCENTAGE!H13/eSUBMAR!$C$11*10","v":0},null,null,null,null,{"$f":"PERCENTAGE!M13/eSUBMAR!$D$6*10","v":0},{"$f":"PERCENTAGE!N13/eSUBMAR!$D$7*10","v":0},{"$f":"PERCENTAGE!O13/eSUBMAR!$D$8*10","v":0},{"$f":"PERCENTAGE!P13/eSUBMAR!$D$9*10","v":0},{"$f":"PERCENTAGE!Q13/eSUBMAR!$D$10*10","v":0},{"$f":"PERCENTAGE!R13/eSUBMAR!$D$11*10","v":0},null,null,null,null,{"$f":"PERCENTAGE!W13/eSUBMAR!$E$6*10","v":0},{"$f":"PERCENTAGE!X13/eSUBMAR!$E$7*10","v":0},{"$f":"PERCENTAGE!Y13/eSUBMAR!$E$8*10","v":0},{"$f":"PERCENTAGE!Z13/eSUBMAR!$E$9*10","v":0},{"$f":"PERCENTAGE!AA13/eSUBMAR!$E$10*10","v":0},{"$f":"PERCENTAGE!AB13/eSUBMAR!$E$11*10","v":0}]
[{"$f":"eSPAR!A13","v":0},{"$f":"eSPAR!B13","v":0},{"$f":"PERCENTAGE!C14/eSUBMAR!$C$6*10","v":0},{"$f":"PERCENTAGE!D14/eSUBMAR!$C$7*10","v":0},{"$f":"PERCENTAGE!E14/eSUBMAR!$C$8*10","v":0},{"$f":"PERCENTAGE!F14/eSUBMAR!$C$9*10","v":0},{"$f":"PERCENTAGE!G14/eSUBMAR!$C$10*10","v":0},{"$f":"PERCENTAGE!H14/eSUBMAR!$C$11*10","v":0},null,null,null,null,{"$f":"PERCENTAGE!M14/eSUBMAR!$D$6*10","v":0},{"$f":"PERCENTAGE!N14/eSUBMAR!$D$7*10","v":0},{"$f":"PERCENTAGE!O14/eSUBMAR!$D$8*10","v":0},{"$f":"PERCENTAGE!P14/eSUBMAR!$D$9*10","v":0},{"$f":"PERCENTAGE!Q14/eSUBMAR!$D$10*10","v":0},{"$f":"PERCENTAGE!R14/eSUBMAR!$D$11*10","v":0},null,null,null,null,{"$f":"PERCENTAGE!W14/eSUBMAR!$E$6*10","v":0},{"$f":"PERCENTAGE!X14/eSUBMAR!$E$7*10","v":0},{"$f":"PERCENTAGE!Y14/eSUBMAR!$E$8*10","v":0},{"$f":"PERCENTAGE!Z14/eSUBMAR!$E$9*10","v":0},{"$f":"PERCENTAGE!AA14/eSUBMAR!$E$10*10","v":0},{"$f":"PERCENTAGE!AB14/eSUBMAR!$E$11*10","v":0}]
[{"$f":"eSPAR!A14","v":0},{"$f":"eSPAR!B14","v":0},{"$f":"PERCENTAGE!C15/eSUBMAR!$C$6*10","v":0},{"$f":"PERCENTAGE!D15/eSUBMAR!$C$7*10","v":0},{"$f":"PERCENTAGE!E15/eSUBMAR!$C$8*10","v":0},{"$f":"PERCENTAGE!F15/eSUBMAR!$C$9*10","v":0},{"$f":"PERCENTAGE!G15/eSUBMAR!$C$10*10","v":0},{"$f":"PERCENTAGE!H15/eSUBMAR!$C$11*10","v":0},null,null,null,null,{"$f":"PERCENTAGE!M15/eSUBMAR!$D$6*10","v":0},{"$f":"PERCENTAGE!N15/eSUBMAR!$D$7*10","v":0},{"$f":"PERCENTAGE!O15/eSUBMAR!$D$8*10","v":0},{"$f":"PERCENTAGE!P15/eSUBMAR!$D$9*10","v":0},{"$f":"PERCENTAGE!Q15/eSUBMAR!$D$10*10","v":0},{"$f":"PERCENTAGE!R15/eSUBMAR!$D$11*10","v":0},null,null,null,null,{"$f":"PERCENTAGE!W15/eSUBMAR!$E$6*10","v":0},{"$f":"PERCENTAGE!X15/eSUBMAR!$E$7*10","v":0},{"$f":"PERCENTAGE!Y15/eSUBMAR!$E$8*10","v":0},{"$f":"PERCENTAGE!Z15/eSUBMAR!$E$9*10","v":0},{"$f":"PERCENTAGE!AA15/eSUBMAR!$E$10*10","v":0},{"$f":"PERCENTAGE!AB15/eSUBMAR!$E$11*10","v":0}]
[{"$f":"eSPAR!A15","v":0},{"$f":"eSPAR!B15","v":0},{"$f":"PERCENTAGE!C16/eSUBMAR!$C$6*10","v":0},{"$f":"PERCENTAGE!D16/eSUBMAR!$C$7*10","v":0},{"$f":"PERCENTAGE!E16/eSUBMAR!$C$8*10","v":0},{"$f":"PERCENTAGE!F16/eSUBMAR!$C$9*10","v":0},{"$f":"PERCENTAGE!G16/eSUBMAR!$C$10*10","v":0},{"$f":"PERCENTAGE!H16/eSUBMAR!$C$11*10","v":0},null,null,null,null,{"$f":"PERCENTAGE!M16/eSUBMAR!$D$6*10","v":0},{"$f":"PERCENTAGE!N16/eSUBMAR!$D$7*10","v":0},{"$f":"PERCENTAGE!O16/eSUBMAR!$D$8*10","v":0},{"$f":"PERCENTAGE!P16/eSUBMAR!$D$9*10","v":0},{"$f":"PERCENTAGE!Q16/eSUBMAR!$D$10*10","v":0},{"$f":"PERCENTAGE!R16/eSUBMAR!$D$11*10","v":0},null,null,null,null,{"$f":"PERCENTAGE!W16/eSUBMAR!$E$6*10","v":0},{"$f":"PERCENTAGE!X16/eSUBMAR!$E$7*10","v":0},{"$f":"PERCENTAGE!Y16/eSUBMAR!$E$8*10","v":0},{"$f":"PERCENTAGE!Z16/eSUBMAR!$E$9*10","v":0},{"$f":"PERCENTAGE!AA16/eSUBMAR!$E$10*10","v":0},{"$f":"PERCENTAGE!AB16/eSUBMAR!$E$11*10","v":0}]
[{"$f":"eSPAR!A16","v":0},{"$f":"eSPAR!B16","v":0},{"$f":"PERCENTAGE!C17/eSUBMAR!$C$6*10","v":0},{"$f":"PERCENTAGE!D17/eSUBMAR!$C$7*10","v":0},{"$f":"PERCENTAGE!E17/eSUBMAR!$C$8*10","v":0},{"$f":"PERCENTAGE!F17/eSUBMAR!$C$9*10","v":0},{"$f":"PERCENTAGE!G17/eSUBMAR!$C$10*10","v":0},{"$f":"PERCENTAGE!H17/eSUBMAR!$C$11*10","v":0},null,null,null,null,{"$f":"PERCENTAGE!M17/eSUBMAR!$D$6*10","v":0},{"$f":"PERCENTAGE!N17/eSUBMAR!$D$7*10","v":0},{"$f":"PERCENTAGE!O17/eSUBMAR!$D$8*10","v":0},{"$f":"PERCENTAGE!P17/eSUBMAR!$D$9*10","v":0},{"$f":"PERCENTAGE!Q17/eSUBMAR!$D$10*10","v":0},{"$f":"PERCENTAGE!R17/eSUBMAR!$D$11*10","v":0},null,null,null,null,{"$f":"PERCENTAGE!W17/eSUBMAR!$E$6*10","v":0},{"$f":"PERCENTAGE!X17/eSUBMAR!$E$7*10","v":0},{"$f":"PERCENTAGE!Y17/eSUBMAR!$E$8*10","v":0},{"$f":"PERCENTAGE!Z17/eSUBMAR!$E$9*10","v":0},{"$f":"PERCENTAGE!AA17/eSUBMAR!$E$10*10","v":0},{"$f":"PERCENTAGE!AB17/eSUBMAR!$E$11*10","v":0}]
[{"$f":"eSPAR!A17","v":0},{"$f":"eSPAR!B17","v":0},{"$f":"PERCENTAGE!C18/eSUBMAR!$C$6*10","v":0},{"$f":"PERCENTAGE!D18/eSUBMAR!$C$7*10","v":0},{"$f":"PERCENTAGE!E18/eSUBMAR!$C$8*10","v":0},{"$f":"PERCENTAGE!F18/eSUBMAR!$C$9*10","v":0},{"$f":"PERCENTAGE!G18/eSUBMAR!$C$10*10","v":0},{"$f":"PERCENTAGE!H18/eSUBMAR!$C$11*10","v":0},null,null,null,null,{"$f":"PERCENTAGE!M18/eSUBMAR!$D$6*10","v":0},{"$f":"PERCENTAGE!N18/eSUBMAR!$D$7*10","v":0},{"$f":"PERCENTAGE!O18/eSUBMAR!$D$8*10","v":0},{"$f":"PERCENTAGE!P18/eSUBMAR!$D$9*10","v":0},{"$f":"PERCENTAGE!Q18/eSUBMAR!$D$10*10","v":0},{"$f":"PERCENTAGE!R18/eSUBMAR!$D$11*10","v":0},null,null,null,null,{"$f":"PERCENTAGE!W18/eSUBMAR!$E$6*10","v":0},{"$f":"PERCENTAGE!X18/eSUBMAR!$E$7*10","v":0},{"$f":"PERCENTAGE!Y18/eSUBMAR!$E$8*10","v":0},{"$f":"PERCENTAGE!Z18/eSUBMAR!$E$9*10","v":0},{"$f":"PERCENTAGE!AA18/eSUBMAR!$E$10*10","v":0},{"$f":"PERCENTAGE!AB18/eSUBMAR!$E$11*10","v":0}]
[{"$f":"eSPAR!A18","v":0},{"$f":"eSPAR!B18","v":0},{"$f":"PERCENTAGE!C19/eSUBMAR!$C$6*10","v":0},{"$f":"PERCENTAGE!D19/eSUBMAR!$C$7*10","v":0},{"$f":"PERCENTAGE!E19/eSUBMAR!$C$8*10","v":0},{"$f":"PERCENTAGE!F19/eSUBMAR!$C$9*10","v":0},{"$f":"PERCENTAGE!G19/eSUBMAR!$C$10*10","v":0},{"$f":"PERCENTAGE!H19/eSUBMAR!$C$11*10","v":0},null,null,null,null,{"$f":"PERCENTAGE!M19/eSUBMAR!$D$6*10","v":0},{"$f":"PERCENTAGE!N19/eSUBMAR!$D$7*10","v":0},{"$f":"PERCENTAGE!O19/eSUBMAR!$D$8*10","v":0},{"$f":"PERCENTAGE!P19/eSUBMAR!$D$9*10","v":0},{"$f":"PERCENTAGE!Q19/eSUBMAR!$D$10*10","v":0},{"$f":"PERCENTAGE!R19/eSUBMAR!$D$11*10","v":0},null,null,null,null,{"$f":"PERCENTAGE!W19/eSUBMAR!$E$6*10","v":0},{"$f":"PERCENTAGE!X19/eSUBMAR!$E$7*10","v":0},{"$f":"PERCENTAGE!Y19/eSUBMAR!$E$8*10","v":0},{"$f":"PERCENTAGE!Z19/eSUBMAR!$E$9*10","v":0},{"$f":"PERCENTAGE!AA19/eSUBMAR!$E$10*10","v":0},{"$f":"PERCENTAGE!AB19/eSUBMAR!$E$11*10","v":0}]
[{"$f":"eSPAR!A19","v":0},{"$f":"eSPAR!B19","v":0},{"$f":"PERCENTAGE!C20/eSUBMAR!$C$6*10","v":0},{"$f":"PERCENTAGE!D20/eSUBMAR!$C$7*10","v":0},{"$f":"PERCENTAGE!E20/eSUBMAR!$C$8*10","v":0},{"$f":"PERCENTAGE!F20/eSUBMAR!$C$9*10","v":0},{"$f":"PERCENTAGE!G20/eSUBMAR!$C$10*10","v":0},{"$f":"PERCENTAGE!H20/eSUBMAR!$C$11*10","v":0},null,null,null,null,{"$f":"PERCENTAGE!M20/eSUBMAR!$D$6*10","v":0},{"$f":"PERCENTAGE!N20/eSUBMAR!$D$7*10","v":0},{"$f":"PERCENTAGE!O20/eSUBMAR!$D$8*10","v":0},{"$f":"PERCENTAGE!P20/eSUBMAR!$D$9*10","v":0},{"$f":"PERCENTAGE!Q20/eSUBMAR!$D$10*10","v":0},{"$f":"PERCENTAGE!R20/eSUBMAR!$D$11*10","v":0},null,null,null,null,{"$f":"PERCENTAGE!W20/eSUBMAR!$E$6*10","v":0},{"$f":"PERCENTAGE!X20/eSUBMAR!$E$7*10","v":0},{"$f":"PERCENTAGE!Y20/eSUBMAR!$E$8*10","v":0},{"$f":"PERCENTAGE!Z20/eSUBMAR!$E$9*10","v":0},{"$f":"PERCENTAGE!AA20/eSUBMAR!$E$10*10","v":0},{"$f":"PERCENTAGE!AB20/eSUBMAR!$E$11*10","v":0}]
[{"$f":"eSPAR!A20","v":0},{"$f":"eSPAR!B20","v":0},{"$f":"PERCENTAGE!C21/eSUBMAR!$C$6*10","v":0},{"$f":"PERCENTAGE!D21/eSUBMAR!$C$7*10","v":0},{"$f":"PERCENTAGE!E21/eSUBMAR!$C$8*10","v":0},{"$f":"PERCENTAGE!F21/eSUBMAR!$C$9*10","v":0},{"$f":"PERCENTAGE!G21/eSUBMAR!$C$10*10","v":0},{"$f":"PERCENTAGE!H21/eSUBMAR!$C$11*10","v":0},null,null,null,null,{"$f":"PERCENTAGE!M21/eSUBMAR!$D$6*10","v":0},{"$f":"PERCENTAGE!N21/eSUBMAR!$D$7*10","v":0},{"$f":"PERCENTAGE!O21/eSUBMAR!$D$8*10","v":0},{"$f":"PERCENTAGE!P21/eSUBMAR!$D$9*10","v":0},{"$f":"PERCENTAGE!Q21/eSUBMAR!$D$10*10","v":0},{"$f":"PERCENTAGE!R21/eSUBMAR!$D$11*10","v":0},null,null,null,null,{"$f":"PERCENTAGE!W21/eSUBMAR!$E$6*10","v":0},{"$f":"PERCENTAGE!X21/eSUBMAR!$E$7*10","v":0},{"$f":"PERCENTAGE!Y21/eSUBMAR!$E$8*10","v":0},{"$f":"PERCENTAGE!Z21/eSUBMAR!$E$9*10","v":0},{"$f":"PERCENTAGE!AA21/eSUBMAR!$E$10*10","v":0},{"$f":"PERCENTAGE!AB21/eSUBMAR!$E$11*10","v":0}]
[{"$f":"eSPAR!A21","v":0},{"$f":"eSPAR!B21","v":0},{"$f":"PERCENTAGE!C22/eSUBMAR!$C$6*10","v":0},{"$f":"PERCENTAGE!D22/eSUBMAR!$C$7*10","v":0},{"$f":"PERCENTAGE!E22/eSUBMAR!$C$8*10","v":0},{"$f":"PERCENTAGE!F22/eSUBMAR!$C$9*10","v":0},{"$f":"PERCENTAGE!G22/eSUBMAR!$C$10*10","v":0},{"$f":"PERCENTAGE!H22/eSUBMAR!$C$11*10","v":0},null,null,null,null,{"$f":"PERCENTAGE!M22/eSUBMAR!$D$6*10","v":0},{"$f":"PERCENTAGE!N22/eSUBMAR!$D$7*10","v":0},{"$f":"PERCENTAGE!O22/eSUBMAR!$D$8*10","v":0},{"$f":"PERCENTAGE!P22/eSUBMAR!$D$9*10","v":0},{"$f":"PERCENTAGE!Q22/eSUBMAR!$D$10*10","v":0},{"$f":"PERCENTAGE!R22/eSUBMAR!$D$11*10","v":0},null,null,null,null,{"$f":"PERCENTAGE!W22/eSUBMAR!$E$6*10","v":0},{"$f":"PERCENTAGE!X22/eSUBMAR!$E$7*10","v":0},{"$f":"PERCENTAGE!Y22/eSUBMAR!$E$8*10","v":0},{"$f":"PERCENTAGE!Z22/eSUBMAR!$E$9*10","v":0},{"$f":"PERCENTAGE!AA22/eSUBMAR!$E$10*10","v":0},{"$f":"PERCENTAGE!AB22/eSUBMAR!$E$11*10","v":0}]
[{"$f":"eSPAR!A22","v":0},{"$f":"eSPAR!B22","v":0},{"$f":"PERCENTAGE!C23/eSUBMAR!$C$6*10","v":0},{"$f":"PERCENTAGE!D23/eSUBMAR!$C$7*10","v":0},{"$f":"PERCENTAGE!E23/eSUBMAR!$C$8*10","v":0},{"$f":"PERCENTAGE!F23/eSUBMAR!$C$9*10","v":0},{"$f":"PERCENTAGE!G23/eSUBMAR!$C$10*10","v":0},{"$f":"PERCENTAGE!H23/eSUBMAR!$C$11*10","v":0},null,null,null,null,{"$f":"PERCENTAGE!M23/eSUBMAR!$D$6*10","v":0},{"$f":"PERCENTAGE!N23/eSUBMAR!$D$7*10","v":0},{"$f":"PERCENTAGE!O23/eSUBMAR!$D$8*10","v":0},{"$f":"PERCENTAGE!P23/eSUBMAR!$D$9*10","v":0},{"$f":"PERCENTAGE!Q23/eSUBMAR!$D$10*10","v":0},{"$f":"PERCENTAGE!R23/eSUBMAR!$D$11*10","v":0},null,null,null,null,{"$f":"PERCENTAGE!W23/eSUBMAR!$E$6*10","v":0},{"$f":"PERCENTAGE!X23/eSUBMAR!$E$7*10","v":0},{"$f":"PERCENTAGE!Y23/eSUBMAR!$E$8*10","v":0},{"$f":"PERCENTAGE!Z23/eSUBMAR!$E$9*10","v":0},{"$f":"PERCENTAGE!AA23/eSUBMAR!$E$10*10","v":0},{"$f":"PERCENTAGE!AB23/eSUBMAR!$E$11*10","v":0}]
[{"$f":"eSPAR!A23","v":0},{"$f":"eSPAR!B23","v":0},{"$f":"PERCENTAGE!C24/eSUBMAR!$C$6*10","v":0},{"$f":"PERCENTAGE!D24/eSUBMAR!$C$7*10","v":0},{"$f":"PERCENTAGE!E24/eSUBMAR!$C$8*10","v":0},{"$f":"PERCENTAGE!F24/eSUBMAR!$C$9*10","v":0},{"$f":"PERCENTAGE!G24/eSUBMAR!$C$10*10","v":0},{"$f":"PERCENTAGE!H24/eSUBMAR!$C$11*10","v":0},null,null,null,null,{"$f":"PERCENTAGE!M24/eSUBMAR!$D$6*10","v":0},{"$f":"PERCENTAGE!N24/eSUBMAR!$D$7*10","v":0},{"$f":"PERCENTAGE!O24/eSUBMAR!$D$8*10","v":0},{"$f":"PERCENTAGE!P24/eSUBMAR!$D$9*10","v":0},{"$f":"PERCENTAGE!Q24/eSUBMAR!$D$10*10","v":0},{"$f":"PERCENTAGE!R24/eSUBMAR!$D$11*10","v":0},null,null,null,null,{"$f":"PERCENTAGE!W24/eSUBMAR!$E$6*10","v":0},{"$f":"PERCENTAGE!X24/eSUBMAR!$E$7*10","v":0},{"$f":"PERCENTAGE!Y24/eSUBMAR!$E$8*10","v":0},{"$f":"PERCENTAGE!Z24/eSUBMAR!$E$9*10","v":0},{"$f":"PERCENTAGE!AA24/eSUBMAR!$E$10*10","v":0},{"$f":"PERCENTAGE!AB24/eSUBMAR!$E$11*10","v":0}]
[{"$f":"eSPAR!A24","v":0},{"$f":"eSPAR!B24","v":0},{"$f":"PERCENTAGE!C25/eSUBMAR!$C$6*10","v":0},{"$f":"PERCENTAGE!D25/eSUBMAR!$C$7*10","v":0},{"$f":"PERCENTAGE!E25/eSUBMAR!$C$8*10","v":0},{"$f":"PERCENTAGE!F25/eSUBMAR!$C$9*10","v":0},{"$f":"PERCENTAGE!G25/eSUBMAR!$C$10*10","v":0},{"$f":"PERCENTAGE!H25/eSUBMAR!$C$11*10","v":0},null,null,null,null,{"$f":"PERCENTAGE!M25/eSUBMAR!$D$6*10","v":0},{"$f":"PERCENTAGE!N25/eSUBMAR!$D$7*10","v":0},{"$f":"PERCENTAGE!O25/eSUBMAR!$D$8*10","v":0},{"$f":"PERCENTAGE!P25/eSUBMAR!$D$9*10","v":0},{"$f":"PERCENTAGE!Q25/eSUBMAR!$D$10*10","v":0},{"$f":"PERCENTAGE!R25/eSUBMAR!$D$11*10","v":0},null,null,null,null,{"$f":"PERCENTAGE!W25/eSUBMAR!$E$6*10","v":0},{"$f":"PERCENTAGE!X25/eSUBMAR!$E$7*10","v":0},{"$f":"PERCENTAGE!Y25/eSUBMAR!$E$8*10","v":0},{"$f":"PERCENTAGE!Z25/eSUBMAR!$E$9*10","v":0},{"$f":"PERCENTAGE!AA25/eSUBMAR!$E$10*10","v":0},{"$f":"PERCENTAGE!AB25/eSUBMAR!$E$11*10","v":0}]
[{"$f":"eSPAR!A25","v":0},{"$f":"eSPAR!B25","v":0},{"$f":"PERCENTAGE!C26/eSUBMAR!$C$6*10","v":0},{"$f":"PERCENTAGE!D26/eSUBMAR!$C$7*10","v":0},{"$f":"PERCENTAGE!E26/eSUBMAR!$C$8*10","v":0},{"$f":"PERCENTAGE!F26/eSUBMAR!$C$9*10","v":0},{"$f":"PERCENTAGE!G26/eSUBMAR!$C$10*10","v":0},{"$f":"PERCENTAGE!H26/eSUBMAR!$C$11*10","v":0},null,null,null,null,{"$f":"PERCENTAGE!M26/eSUBMAR!$D$6*10","v":0},{"$f":"PERCENTAGE!N26/eSUBMAR!$D$7*10","v":0},{"$f":"PERCENTAGE!O26/eSUBMAR!$D$8*10","v":0},{"$f":"PERCENTAGE!P26/eSUBMAR!$D$9*10","v":0},{"$f":"PERCENTAGE!Q26/eSUBMAR!$D$10*10","v":0},{"$f":"PERCENTAGE!R26/eSUBMAR!$D$11*10","v":0},null,null,null,null,{"$f":"PERCENTAGE!W26/eSUBMAR!$E$6*10","v":0},{"$f":"PERCENTAGE!X26/eSUBMAR!$E$7*10","v":0},{"$f":"PERCENTAGE!Y26/eSUBMAR!$E$8*10","v":0},{"$f":"PERCENTAGE!Z26/eSUBMAR!$E$9*10","v":0},{"$f":"PERCENTAGE!AA26/eSUBMAR!$E$10*10","v":0},{"$f":"PERCENTAGE!AB26/eSUBMAR!$E$11*10","v":0}]
[{"$f":"eSPAR!A26","v":0},{"$f":"eSPAR!B26","v":0},{"$f":"PERCENTAGE!C27/eSUBMAR!$C$6*10","v":0},{"$f":"PERCENTAGE!D27/eSUBMAR!$C$7*10","v":0},{"$f":"PERCENTAGE!E27/eSUBMAR!$C$8*10","v":0},{"$f":"PERCENTAGE!F27/eSUBMAR!$C$9*10","v":0},{"$f":"PERCENTAGE!G27/eSUBMAR!$C$10*10","v":0},{"$f":"PERCENTAGE!H27/eSUBMAR!$C$11*10","v":0},null,null,null,null,{"$f":"PERCENTAGE!M27/eSUBMAR!$D$6*10","v":0},{"$f":"PERCENTAGE!N27/eSUBMAR!$D$7*10","v":0},{"$f":"PERCENTAGE!O27/eSUBMAR!$D$8*10","v":0},{"$f":"PERCENTAGE!P27/eSUBMAR!$D$9*10","v":0},{"$f":"PERCENTAGE!Q27/eSUBMAR!$D$10*10","v":0},{"$f":"PERCENTAGE!R27/eSUBMAR!$D$11*10","v":0},null,null,null,null,{"$f":"PERCENTAGE!W27/eSUBMAR!$E$6*10","v":0},{"$f":"PERCENTAGE!X27/eSUBMAR!$E$7*10","v":0},{"$f":"PERCENTAGE!Y27/eSUBMAR!$E$8*10","v":0},{"$f":"PERCENTAGE!Z27/eSUBMAR!$E$9*10","v":0},{"$f":"PERCENTAGE!AA27/eSUBMAR!$E$10*10","v":0},{"$f":"PERCENTAGE!AB27/eSUBMAR!$E$11*10","v":0}]
[{"$f":"eSPAR!A27","v":0},{"$f":"eSPAR!B27","v":0},{"$f":"PERCENTAGE!C28/eSUBMAR!$C$6*10","v":0},{"$f":"PERCENTAGE!D28/eSUBMAR!$C$7*10","v":0},{"$f":"PERCENTAGE!E28/eSUBMAR!$C$8*10","v":0},{"$f":"PERCENTAGE!F28/eSUBMAR!$C$9*10","v":0},{"$f":"PERCENTAGE!G28/eSUBMAR!$C$10*10","v":0},{"$f":"PERCENTAGE!H28/eSUBMAR!$C$11*10","v":0},null,null,null,null,{"$f":"PERCENTAGE!M28/eSUBMAR!$D$6*10","v":0},{"$f":"PERCENTAGE!N28/eSUBMAR!$D$7*10","v":0},{"$f":"PERCENTAGE!O28/eSUBMAR!$D$8*10","v":0},{"$f":"PERCENTAGE!P28/eSUBMAR!$D$9*10","v":0},{"$f":"PERCENTAGE!Q28/eSUBMAR!$D$10*10","v":0},{"$f":"PERCENTAGE!R28/eSUBMAR!$D$11*10","v":0},null,null,null,null,{"$f":"PERCENTAGE!W28/eSUBMAR!$E$6*10","v":0},{"$f":"PERCENTAGE!X28/eSUBMAR!$E$7*10","v":0},{"$f":"PERCENTAGE!Y28/eSUBMAR!$E$8*10","v":0},{"$f":"PERCENTAGE!Z28/eSUBMAR!$E$9*10","v":0},{"$f":"PERCENTAGE!AA28/eSUBMAR!$E$10*10","v":0},{"$f":"PERCENTAGE!AB28/eSUBMAR!$E$11*10","v":0}]
[{"$f":"eSPAR!A28","v":0},{"$f":"eSPAR!B28","v":0},{"$f":"PERCENTAGE!C29/eSUBMAR!$C$6*10","v":0},{"$f":"PERCENTAGE!D29/eSUBMAR!$C$7*10","v":0},{"$f":"PERCENTAGE!E29/eSUBMAR!$C$8*10","v":0},{"$f":"PERCENTAGE!F29/eSUBMAR!$C$9*10","v":0},{"$f":"PERCENTAGE!G29/eSUBMAR!$C$10*10","v":0},{"$f":"PERCENTAGE!H29/eSUBMAR!$C$11*10","v":0},null,null,null,null,{"$f":"PERCENTAGE!M29/eSUBMAR!$D$6*10","v":0},{"$f":"PERCENTAGE!N29/eSUBMAR!$D$7*10","v":0},{"$f":"PERCENTAGE!O29/eSUBMAR!$D$8*10","v":0},{"$f":"PERCENTAGE!P29/eSUBMAR!$D$9*10","v":0},{"$f":"PERCENTAGE!Q29/eSUBMAR!$D$10*10","v":0},{"$f":"PERCENTAGE!R29/eSUBMAR!$D$11*10","v":0},null,null,null,null,{"$f":"PERCENTAGE!W29/eSUBMAR!$E$6*10","v":0},{"$f":"PERCENTAGE!X29/eSUBMAR!$E$7*10","v":0},{"$f":"PERCENTAGE!Y29/eSUBMAR!$E$8*10","v":0},{"$f":"PERCENTAGE!Z29/eSUBMAR!$E$9*10","v":0},{"$f":"PERCENTAGE!AA29/eSUBMAR!$E$10*10","v":0},{"$f":"PERCENTAGE!AB29/eSUBMAR!$E$11*10","v":0}]
[{"$f":"eSPAR!A29","v":0},{"$f":"eSPAR!B29","v":0},{"$f":"PERCENTAGE!C30/eSUBMAR!$C$6*10","v":0},{"$f":"PERCENTAGE!D30/eSUBMAR!$C$7*10","v":0},{"$f":"PERCENTAGE!E30/eSUBMAR!$C$8*10","v":0},{"$f":"PERCENTAGE!F30/eSUBMAR!$C$9*10","v":0},{"$f":"PERCENTAGE!G30/eSUBMAR!$C$10*10","v":0},{"$f":"PERCENTAGE!H30/eSUBMAR!$C$11*10","v":0},null,null,null,null,{"$f":"PERCENTAGE!M30/eSUBMAR!$D$6*10","v":0},{"$f":"PERCENTAGE!N30/eSUBMAR!$D$7*10","v":0},{"$f":"PERCENTAGE!O30/eSUBMAR!$D$8*10","v":0},{"$f":"PERCENTAGE!P30/eSUBMAR!$D$9*10","v":0},{"$f":"PERCENTAGE!Q30/eSUBMAR!$D$10*10","v":0},{"$f":"PERCENTAGE!R30/eSUBMAR!$D$11*10","v":0},null,null,null,null,{"$f":"PERCENTAGE!W30/eSUBMAR!$E$6*10","v":0},{"$f":"PERCENTAGE!X30/eSUBMAR!$E$7*10","v":0},{"$f":"PERCENTAGE!Y30/eSUBMAR!$E$8*10","v":0},{"$f":"PERCENTAGE!Z30/eSUBMAR!$E$9*10","v":0},{"$f":"PERCENTAGE!AA30/eSUBMAR!$E$10*10","v":0},{"$f":"PERCENTAGE!AB30/eSUBMAR!$E$11*10","v":0}]
[{"$f":"eSPAR!A30","v":0},{"$f":"eSPAR!B30","v":0},{"$f":"PERCENTAGE!C31/eSUBMAR!$C$6*10","v":0},{"$f":"PERCENTAGE!D31/eSUBMAR!$C$7*10","v":0},{"$f":"PERCENTAGE!E31/eSUBMAR!$C$8*10","v":0},{"$f":"PERCENTAGE!F31/eSUBMAR!$C$9*10","v":0},{"$f":"PERCENTAGE!G31/eSUBMAR!$C$10*10","v":0},{"$f":"PERCENTAGE!H31/eSUBMAR!$C$11*10","v":0},null,null,null,null,{"$f":"PERCENTAGE!M31/eSUBMAR!$D$6*10","v":0},{"$f":"PERCENTAGE!N31/eSUBMAR!$D$7*10","v":0},{"$f":"PERCENTAGE!O31/eSUBMAR!$D$8*10","v":0},{"$f":"PERCENTAGE!P31/eSUBMAR!$D$9*10","v":0},{"$f":"PERCENTAGE!Q31/eSUBMAR!$D$10*10","v":0},{"$f":"PERCENTAGE!R31/eSUBMAR!$D$11*10","v":0},null,null,null,null,{"$f":"PERCENTAGE!W31/eSUBMAR!$E$6*10","v":0},{"$f":"PERCENTAGE!X31/eSUBMAR!$E$7*10","v":0},{"$f":"PERCENTAGE!Y31/eSUBMAR!$E$8*10","v":0},{"$f":"PERCENTAGE!Z31/eSUBMAR!$E$9*10","v":0},{"$f":"PERCENTAGE!AA31/eSUBMAR!$E$10*10","v":0},{"$f":"PERCENTAGE!AB31/eSUBMAR!$E$11*10","v":0}]
[{"$f":"eSPAR!A31","v":0},{"$f":"eSPAR!B31","v":0},{"$f":"PERCENTAGE!C32/eSUBMAR!$C$6*10","v":0},{"$f":"PERCENTAGE!D32/eSUBMAR!$C$7*10","v":0},{"$f":"PERCENTAGE!E32/eSUBMAR!$C$8*10","v":0},{"$f":"PERCENTAGE!F32/eSUBMAR!$C$9*10","v":0},{"$f":"PERCENTAGE!G32/eSUBMAR!$C$10*10","v":0},{"$f":"PERCENTAGE!H32/eSUBMAR!$C$11*10","v":0},null,null,null,null,{"$f":"PERCENTAGE!M32/eSUBMAR!$D$6*10","v":0},{"$f":"PERCENTAGE!N32/eSUBMAR!$D$7*10","v":0},{"$f":"PERCENTAGE!O32/eSUBMAR!$D$8*10","v":0},{"$f":"PERCENTAGE!P32/eSUBMAR!$D$9*10","v":0},{"$f":"PERCENTAGE!Q32/eSUBMAR!$D$10*10","v":0},{"$f":"PERCENTAGE!R32/eSUBMAR!$D$11*10","v":0},null,null,null,null,{"$f":"PERCENTAGE!W32/eSUBMAR!$E$6*10","v":0},{"$f":"PERCENTAGE!X32/eSUBMAR!$E$7*10","v":0},{"$f":"PERCENTAGE!Y32/eSUBMAR!$E$8*10","v":0},{"$f":"PERCENTAGE!Z32/eSUBMAR!$E$9*10","v":0},{"$f":"PERCENTAGE!AA32/eSUBMAR!$E$10*10","v":0},{"$f":"PERCENTAGE!AB32/eSUBMAR!$E$11*10","v":0}]
[{"$f":"eSPAR!A32","v":0},{"$f":"eSPAR!B32","v":0},{"$f":"PERCENTAGE!C33/eSUBMAR!$C$6*10","v":0},{"$f":"PERCENTAGE!D33/eSUBMAR!$C$7*10","v":0},{"$f":"PERCENTAGE!E33/eSUBMAR!$C$8*10","v":0},{"$f":"PERCENTAGE!F33/eSUBMAR!$C$9*10","v":0},{"$f":"PERCENTAGE!G33/eSUBMAR!$C$10*10","v":0},{"$f":"PERCENTAGE!H33/eSUBMAR!$C$11*10","v":0},null,null,null,null,{"$f":"PERCENTAGE!M33/eSUBMAR!$D$6*10","v":0},{"$f":"PERCENTAGE!N33/eSUBMAR!$D$7*10","v":0},{"$f":"PERCENTAGE!O33/eSUBMAR!$D$8*10","v":0},{"$f":"PERCENTAGE!P33/eSUBMAR!$D$9*10","v":0},{"$f":"PERCENTAGE!Q33/eSUBMAR!$D$10*10","v":0},{"$f":"PERCENTAGE!R33/eSUBMAR!$D$11*10","v":0},null,null,null,null,{"$f":"PERCENTAGE!W33/eSUBMAR!$E$6*10","v":0},{"$f":"PERCENTAGE!X33/eSUBMAR!$E$7*10","v":0},{"$f":"PERCENTAGE!Y33/eSUBMAR!$E$8*10","v":0},{"$f":"PERCENTAGE!Z33/eSUBMAR!$E$9*10","v":0},{"$f":"PERCENTAGE!AA33/eSUBMAR!$E$10*10","v":0},{"$f":"PERCENTAGE!AB33/eSUBMAR!$E$11*10","v":0}]
[{"$f":"eSPAR!A33","v":0},{"$f":"eSPAR!B33","v":0},{"$f":"PERCENTAGE!C34/eSUBMAR!$C$6*10","v":0},{"$f":"PERCENTAGE!D34/eSUBMAR!$C$7*10","v":0},{"$f":"PERCENTAGE!E34/eSUBMAR!$C$8*10","v":0},{"$f":"PERCENTAGE!F34/eSUBMAR!$C$9*10","v":0},{"$f":"PERCENTAGE!G34/eSUBMAR!$C$10*10","v":0},{"$f":"PERCENTAGE!H34/eSUBMAR!$C$11*10","v":0},null,null,null,null,{"$f":"PERCENTAGE!M34/eSUBMAR!$D$6*10","v":0},{"$f":"PERCENTAGE!N34/eSUBMAR!$D$7*10","v":0},{"$f":"PERCENTAGE!O34/eSUBMAR!$D$8*10","v":0},{"$f":"PERCENTAGE!P34/eSUBMAR!$D$9*10","v":0},{"$f":"PERCENTAGE!Q34/eSUBMAR!$D$10*10","v":0},{"$f":"PERCENTAGE!R34/eSUBMAR!$D$11*10","v":0},null,null,null,null,{"$f":"PERCENTAGE!W34/eSUBMAR!$E$6*10","v":0},{"$f":"PERCENTAGE!X34/eSUBMAR!$E$7*10","v":0},{"$f":"PERCENTAGE!Y34/eSUBMAR!$E$8*10","v":0},{"$f":"PERCENTAGE!Z34/eSUBMAR!$E$9*10","v":0},{"$f":"PERCENTAGE!AA34/eSUBMAR!$E$10*10","v":0},{"$f":"PERCENTAGE!AB34/eSUBMAR!$E$11*10","v":0}]
[{"$f":"eSPAR!A34","v":0},{"$f":"eSPAR!B34","v":0},{"$f":"PERCENTAGE!C35/eSUBMAR!$C$6*10","v":0},{"$f":"PERCENTAGE!D35/eSUBMAR!$C$7*10","v":0},{"$f":"PERCENTAGE!E35/eSUBMAR!$C$8*10","v":0},{"$f":"PERCENTAGE!F35/eSUBMAR!$C$9*10","v":0},{"$f":"PERCENTAGE!G35/eSUBMAR!$C$10*10","v":0},{"$f":"PERCENTAGE!H35/eSUBMAR!$C$11*10","v":0},null,null,null,null,{"$f":"PERCENTAGE!M35/eSUBMAR!$D$6*10","v":0},{"$f":"PERCENTAGE!N35/eSUBMAR!$D$7*10","v":0},{"$f":"PERCENTAGE!O35/eSUBMAR!$D$8*10","v":0},{"$f":"PERCENTAGE!P35/eSUBMAR!$D$9*10","v":0},{"$f":"PERCENTAGE!Q35/eSUBMAR!$D$10*10","v":0},{"$f":"PERCENTAGE!R35/eSUBMAR!$D$11*10","v":0},null,null,null,null,{"$f":"PERCENTAGE!W35/eSUBMAR!$E$6*10","v":0},{"$f":"PERCENTAGE!X35/eSUBMAR!$E$7*10","v":0},{"$f":"PERCENTAGE!Y35/eSUBMAR!$E$8*10","v":0},{"$f":"PERCENTAGE!Z35/eSUBMAR!$E$9*10","v":0},{"$f":"PERCENTAGE!AA35/eSUBMAR!$E$10*10","v":0},{"$f":"PERCENTAGE!AB35/eSUBMAR!$E$11*10","v":0}]
[{"$f":"eSPAR!A35","v":0},{"$f":"eSPAR!B35","v":0},{"$f":"PERCENTAGE!C36/eSUBMAR!$C$6*10","v":0},{"$f":"PERCENTAGE!D36/eSUBMAR!$C$7*10","v":0},{"$f":"PERCENTAGE!E36/eSUBMAR!$C$8*10","v":0},{"$f":"PERCENTAGE!F36/eSUBMAR!$C$9*10","v":0},{"$f":"PERCENTAGE!G36/eSUBMAR!$C$10*10","v":0},{"$f":"PERCENTAGE!H36/eSUBMAR!$C$11*10","v":0},null,null,null,null,{"$f":"PERCENTAGE!M36/eSUBMAR!$D$6*10","v":0},{"$f":"PERCENTAGE!N36/eSUBMAR!$D$7*10","v":0},{"$f":"PERCENTAGE!O36/eSUBMAR!$D$8*10","v":0},{"$f":"PERCENTAGE!P36/eSUBMAR!$D$9*10","v":0},{"$f":"PERCENTAGE!Q36/eSUBMAR!$D$10*10","v":0},{"$f":"PERCENTAGE!R36/eSUBMAR!$D$11*10","v":0},null,null,null,null,{"$f":"PERCENTAGE!W36/eSUBMAR!$E$6*10","v":0},{"$f":"PERCENTAGE!X36/eSUBMAR!$E$7*10","v":0},{"$f":"PERCENTAGE!Y36/eSUBMAR!$E$8*10","v":0},{"$f":"PERCENTAGE!Z36/eSUBMAR!$E$9*10","v":0},{"$f":"PERCENTAGE!AA36/eSUBMAR!$E$10*10","v":0},{"$f":"PERCENTAGE!AB36/eSUBMAR!$E$11*10","v":0}]
[{"$f":"eSPAR!A36","v":0},{"$f":"eSPAR!B36","v":0},{"$f":"PERCENTAGE!C37/eSUBMAR!$C$6*10","v":0},{"$f":"PERCENTAGE!D37/eSUBMAR!$C$7*10","v":0},{"$f":"PERCENTAGE!E37/eSUBMAR!$C$8*10","v":0},{"$f":"PERCENTAGE!F37/eSUBMAR!$C$9*10","v":0},{"$f":"PERCENTAGE!G37/eSUBMAR!$C$10*10","v":0},{"$f":"PERCENTAGE!H37/eSUBMAR!$C$11*10","v":0},null,null,null,null,{"$f":"PERCENTAGE!M37/eSUBMAR!$D$6*10","v":0},{"$f":"PERCENTAGE!N37/eSUBMAR!$D$7*10","v":0},{"$f":"PERCENTAGE!O37/eSUBMAR!$D$8*10","v":0},{"$f":"PERCENTAGE!P37/eSUBMAR!$D$9*10","v":0},{"$f":"PERCENTAGE!Q37/eSUBMAR!$D$10*10","v":0},{"$f":"PERCENTAGE!R37/eSUBMAR!$D$11*10","v":0},null,null,null,null,{"$f":"PERCENTAGE!W37/eSUBMAR!$E$6*10","v":0},{"$f":"PERCENTAGE!X37/eSUBMAR!$E$7*10","v":0},{"$f":"PERCENTAGE!Y37/eSUBMAR!$E$8*10","v":0},{"$f":"PERCENTAGE!Z37/eSUBMAR!$E$9*10","v":0},{"$f":"PERCENTAGE!AA37/eSUBMAR!$E$10*10","v":0},{"$f":"PERCENTAGE!AB37/eSUBMAR!$E$11*10","v":0}]
[{"$f":"eSPAR!A37","v":0},{"$f":"eSPAR!B37","v":0},{"$f":"PERCENTAGE!C38/eSUBMAR!$C$6*10","v":0},{"$f":"PERCENTAGE!D38/eSUBMAR!$C$7*10","v":0},{"$f":"PERCENTAGE!E38/eSUBMAR!$C$8*10","v":0},{"$f":"PERCENTAGE!F38/eSUBMAR!$C$9*10","v":0},{"$f":"PERCENTAGE!G38/eSUBMAR!$C$10*10","v":0},{"$f":"PERCENTAGE!H38/eSUBMAR!$C$11*10","v":0},null,null,null,null,{"$f":"PERCENTAGE!M38/eSUBMAR!$D$6*10","v":0},{"$f":"PERCENTAGE!N38/eSUBMAR!$D$7*10","v":0},{"$f":"PERCENTAGE!O38/eSUBMAR!$D$8*10","v":0},{"$f":"PERCENTAGE!P38/eSUBMAR!$D$9*10","v":0},{"$f":"PERCENTAGE!Q38/eSUBMAR!$D$10*10","v":0},{"$f":"PERCENTAGE!R38/eSUBMAR!$D$11*10","v":0},null,null,null,null,{"$f":"PERCENTAGE!W38/eSUBMAR!$E$6*10","v":0},{"$f":"PERCENTAGE!X38/eSUBMAR!$E$7*10","v":0},{"$f":"PERCENTAGE!Y38/eSUBMAR!$E$8*10","v":0},{"$f":"PERCENTAGE!Z38/eSUBMAR!$E$9*10","v":0},{"$f":"PERCENTAGE!AA38/eSUBMAR!$E$10*10","v":0},{"$f":"PERCENTAGE!AB38/eSUBMAR!$E$11*10","v":0}]
[{"$f":"eSPAR!A38","v":0},{"$f":"eSPAR!B38","v":0},{"$f":"PERCENTAGE!C39/eSUBMAR!$C$6*10","v":0},{"$f":"PERCENTAGE!D39/eSUBMAR!$C$7*10","v":0},{"$f":"PERCENTAGE!E39/eSUBMAR!$C$8*10","v":0},{"$f":"PERCENTAGE!F39/eSUBMAR!$C$9*10","v":0},{"$f":"PERCENTAGE!G39/eSUBMAR!$C$10*10","v":0},{"$f":"PERCENTAGE!H39/eSUBMAR!$C$11*10","v":0},null,null,null,null,{"$f":"PERCENTAGE!M39/eSUBMAR!$D$6*10","v":0},{"$f":"PERCENTAGE!N39/eSUBMAR!$D$7*10","v":0},{"$f":"PERCENTAGE!O39/eSUBMAR!$D$8*10","v":0},{"$f":"PERCENTAGE!P39/eSUBMAR!$D$9*10","v":0},{"$f":"PERCENTAGE!Q39/eSUBMAR!$D$10*10","v":0},{"$f":"PERCENTAGE!R39/eSUBMAR!$D$11*10","v":0},null,null,null,null,{"$f":"PERCENTAGE!W39/eSUBMAR!$E$6*10","v":0},{"$f":"PERCENTAGE!X39/eSUBMAR!$E$7*10","v":0},{"$f":"PERCENTAGE!Y39/eSUBMAR!$E$8*10","v":0},{"$f":"PERCENTAGE!Z39/eSUBMAR!$E$9*10","v":0},{"$f":"PERCENTAGE!AA39/eSUBMAR!$E$10*10","v":0},{"$f":"PERCENTAGE!AB39/eSUBMAR!$E$11*10","v":0}]
[{"$f":"eSPAR!A39","v":0},{"$f":"eSPAR!B39","v":0},{"$f":"PERCENTAGE!C40/eSUBMAR!$C$6*10","v":0},{"$f":"PERCENTAGE!D40/eSUBMAR!$C$7*10","v":0},{"$f":"PERCENTAGE!E40/eSUBMAR!$C$8*10","v":0},{"$f":"PERCENTAGE!F40/eSUBMAR!$C$9*10","v":0},{"$f":"PERCENTAGE!G40/eSUBMAR!$C$10*10","v":0},{"$f":"PERCENTAGE!H40/eSUBMAR!$C$11*10","v":0},null,null,null,null,{"$f":"PERCENTAGE!M40/eSUBMAR!$D$6*10","v":0},{"$f":"PERCENTAGE!N40/eSUBMAR!$D$7*10","v":0},{"$f":"PERCENTAGE!O40/eSUBMAR!$D$8*10","v":0},{"$f":"PERCENTAGE!P40/eSUBMAR!$D$9*10","v":0},{"$f":"PERCENTAGE!Q40/eSUBMAR!$D$10*10","v":0},{"$f":"PERCENTAGE!R40/eSUBMAR!$D$11*10","v":0},null,null,null,null,{"$f":"PERCENTAGE!W40/eSUBMAR!$E$6*10","v":0},{"$f":"PERCENTAGE!X40/eSUBMAR!$E$7*10","v":0},{"$f":"PERCENTAGE!Y40/eSUBMAR!$E$8*10","v":0},{"$f":"PERCENTAGE!Z40/eSUBMAR!$E$9*10","v":0},{"$f":"PERCENTAGE!AA40/eSUBMAR!$E$10*10","v":0},{"$f":"PERCENTAGE!AB40/eSUBMAR!$E$11*10","v":0}]
[{"$f":"eSPAR!A40","v":0},{"$f":"eSPAR!B40","v":0},{"$f":"PERCENTAGE!C41/eSUBMAR!$C$6*10","v":0},{"$f":"PERCENTAGE!D41/eSUBMAR!$C$7*10","v":0},{"$f":"PERCENTAGE!E41/eSUBMAR!$C$8*10","v":0},{"$f":"PERCENTAGE!F41/eSUBMAR!$C$9*10","v":0},{"$f":"PERCENTAGE!G41/eSUBMAR!$C$10*10","v":0},{"$f":"PERCENTAGE!H41/eSUBMAR!$C$11*10","v":0},null,null,null,null,{"$f":"PERCENTAGE!M41/eSUBMAR!$D$6*10","v":0},{"$f":"PERCENTAGE!N41/eSUBMAR!$D$7*10","v":0},{"$f":"PERCENTAGE!O41/eSUBMAR!$D$8*10","v":0},{"$f":"PERCENTAGE!P41/eSUBMAR!$D$9*10","v":0},{"$f":"PERCENTAGE!Q41/eSUBMAR!$D$10*10","v":0},{"$f":"PERCENTAGE!R41/eSUBMAR!$D$11*10","v":0},null,null,null,null,{"$f":"PERCENTAGE!W41/eSUBMAR!$E$6*10","v":0},{"$f":"PERCENTAGE!X41/eSUBMAR!$E$7*10","v":0},{"$f":"PERCENTAGE!Y41/eSUBMAR!$E$8*10","v":0},{"$f":"PERCENTAGE!Z41/eSUBMAR!$E$9*10","v":0},{"$f":"PERCENTAGE!AA41/eSUBMAR!$E$10*10","v":0},{"$f":"PERCENTAGE!AB41/eSUBMAR!$E$11*10","v":0}]
[{"$f":"eSPAR!A41","v":0},{"$f":"eSPAR!B41","v":0},{"$f":"PERCENTAGE!C42/eSUBMAR!$C$6*10","v":0},{"$f":"PERCENTAGE!D42/eSUBMAR!$C$7*10","v":0},{"$f":"PERCENTAGE!E42/eSUBMAR!$C$8*10","v":0},{"$f":"PERCENTAGE!F42/eSUBMAR!$C$9*10","v":0},{"$f":"PERCENTAGE!G42/eSUBMAR!$C$10*10","v":0},{"$f":"PERCENTAGE!H42/eSUBMAR!$C$11*10","v":0},null,null,null,null,{"$f":"PERCENTAGE!M42/eSUBMAR!$D$6*10","v":0},{"$f":"PERCENTAGE!N42/eSUBMAR!$D$7*10","v":0},{"$f":"PERCENTAGE!O42/eSUBMAR!$D$8*10","v":0},{"$f":"PERCENTAGE!P42/eSUBMAR!$D$9*10","v":0},{"$f":"PERCENTAGE!Q42/eSUBMAR!$D$10*10","v":0},{"$f":"PERCENTAGE!R42/eSUBMAR!$D$11*10","v":0},null,null,null,null,{"$f":"PERCENTAGE!W42/eSUBMAR!$E$6*10","v":0},{"$f":"PERCENTAGE!X42/eSUBMAR!$E$7*10","v":0},{"$f":"PERCENTAGE!Y42/eSUBMAR!$E$8*10","v":0},{"$f":"PERCENTAGE!Z42/eSUBMAR!$E$9*10","v":0},{"$f":"PERCENTAGE!AA42/eSUBMAR!$E$10*10","v":0},{"$f":"PERCENTAGE!AB42/eSUBMAR!$E$11*10","v":0}]
[{"$f":"eSPAR!A42","v":0},{"$f":"eSPAR!B42","v":0},{"$f":"PERCENTAGE!C43/eSUBMAR!$C$6*10","v":0},{"$f":"PERCENTAGE!D43/eSUBMAR!$C$7*10","v":0},{"$f":"PERCENTAGE!E43/eSUBMAR!$C$8*10","v":0},{"$f":"PERCENTAGE!F43/eSUBMAR!$C$9*10","v":0},{"$f":"PERCENTAGE!G43/eSUBMAR!$C$10*10","v":0},{"$f":"PERCENTAGE!H43/eSUBMAR!$C$11*10","v":0},null,null,null,null,{"$f":"PERCENTAGE!M43/eSUBMAR!$D$6*10","v":0},{"$f":"PERCENTAGE!N43/eSUBMAR!$D$7*10","v":0},{"$f":"PERCENTAGE!O43/eSUBMAR!$D$8*10","v":0},{"$f":"PERCENTAGE!P43/eSUBMAR!$D$9*10","v":0},{"$f":"PERCENTAGE!Q43/eSUBMAR!$D$10*10","v":0},{"$f":"PERCENTAGE!R43/eSUBMAR!$D$11*10","v":0},null,null,null,null,{"$f":"PERCENTAGE!W43/eSUBMAR!$E$6*10","v":0},{"$f":"PERCENTAGE!X43/eSUBMAR!$E$7*10","v":0},{"$f":"PERCENTAGE!Y43/eSUBMAR!$E$8*10","v":0},{"$f":"PERCENTAGE!Z43/eSUBMAR!$E$9*10","v":0},{"$f":"PERCENTAGE!AA43/eSUBMAR!$E$10*10","v":0},{"$f":"PERCENTAGE!AB43/eSUBMAR!$E$11*10","v":0}]
[{"$f":"eSPAR!A43","v":0},{"$f":"eSPAR!B43","v":0},{"$f":"PERCENTAGE!C44/eSUBMAR!$C$6*10","v":0},{"$f":"PERCENTAGE!D44/eSUBMAR!$C$7*10","v":0},{"$f":"PERCENTAGE!E44/eSUBMAR!$C$8*10","v":0},{"$f":"PERCENTAGE!F44/eSUBMAR!$C$9*10","v":0},{"$f":"PERCENTAGE!G44/eSUBMAR!$C$10*10","v":0},{"$f":"PERCENTAGE!H44/eSUBMAR!$C$11*10","v":0},null,null,null,null,{"$f":"PERCENTAGE!M44/eSUBMAR!$D$6*10","v":0},{"$f":"PERCENTAGE!N44/eSUBMAR!$D$7*10","v":0},{"$f":"PERCENTAGE!O44/eSUBMAR!$D$8*10","v":0},{"$f":"PERCENTAGE!P44/eSUBMAR!$D$9*10","v":0},{"$f":"PERCENTAGE!Q44/eSUBMAR!$D$10*10","v":0},{"$f":"PERCENTAGE!R44/eSUBMAR!$D$11*10","v":0},null,null,null,null,{"$f":"PERCENTAGE!W44/eSUBMAR!$E$6*10","v":0},{"$f":"PERCENTAGE!X44/eSUBMAR!$E$7*10","v":0},{"$f":"PERCENTAGE!Y44/eSUBMAR!$E$8*10","v":0},{"$f":"PERCENTAGE!Z44/eSUBMAR!$E$9*10","v":0},{"$f":"PERCENTAGE!AA44/eSUBMAR!$E$10*10","v":0},{"$f":"PERCENTAGE!AB44/eSUBMAR!$E$11*10","v":0}]
[{"$f":"eSPAR!A44","v":0},{"$f":"eSPAR!B44","v":0},{"$f":"PERCENTAGE!C45/eSUBMAR!$C$6*10","v":0},{"$f":"PERCENTAGE!D45/eSUBMAR!$C$7*10","v":0},{"$f":"PERCENTAGE!E45/eSUBMAR!$C$8*10","v":0},{"$f":"PERCENTAGE!F45/eSUBMAR!$C$9*10","v":0},{"$f":"PERCENTAGE!G45/eSUBMAR!$C$10*10","v":0},{"$f":"PERCENTAGE!H45/eSUBMAR!$C$11*10","v":0},null,null,null,null,{"$f":"PERCENTAGE!M45/eSUBMAR!$D$6*10","v":0},{"$f":"PERCENTAGE!N45/eSUBMAR!$D$7*10","v":0},{"$f":"PERCENTAGE!O45/eSUBMAR!$D$8*10","v":0},{"$f":"PERCENTAGE!P45/eSUBMAR!$D$9*10","v":0},{"$f":"PERCENTAGE!Q45/eSUBMAR!$D$10*10","v":0},{"$f":"PERCENTAGE!R45/eSUBMAR!$D$11*10","v":0},null,null,null,null,{"$f":"PERCENTAGE!W45/eSUBMAR!$E$6*10","v":0},{"$f":"PERCENTAGE!X45/eSUBMAR!$E$7*10","v":0},{"$f":"PERCENTAGE!Y45/eSUBMAR!$E$8*10","v":0},{"$f":"PERCENTAGE!Z45/eSUBMAR!$E$9*10","v":0},{"$f":"PERCENTAGE!AA45/eSUBMAR!$E$10*10","v":0},{"$f":"PERCENTAGE!AB45/eSUBMAR!$E$11*10","v":0}]
[{"$f":"eSPAR!A45","v":0},{"$f":"eSPAR!B45","v":0},{"$f":"PERCENTAGE!C46/eSUBMAR!$C$6*10","v":0},{"$f":"PERCENTAGE!D46/eSUBMAR!$C$7*10","v":0},{"$f":"PERCENTAGE!E46/eSUBMAR!$C$8*10","v":0},{"$f":"PERCENTAGE!F46/eSUBMAR!$C$9*10","v":0},{"$f":"PERCENTAGE!G46/eSUBMAR!$C$10*10","v":0},{"$f":"PERCENTAGE!H46/eSUBMAR!$C$11*10","v":0},null,null,null,null,{"$f":"PERCENTAGE!M46/eSUBMAR!$D$6*10","v":0},{"$f":"PERCENTAGE!N46/eSUBMAR!$D$7*10","v":0},{"$f":"PERCENTAGE!O46/eSUBMAR!$D$8*10","v":0},{"$f":"PERCENTAGE!P46/eSUBMAR!$D$9*10","v":0},{"$f":"PERCENTAGE!Q46/eSUBMAR!$D$10*10","v":0},{"$f":"PERCENTAGE!R46/eSUBMAR!$D$11*10","v":0},null,null,null,null,{"$f":"PERCENTAGE!W46/eSUBMAR!$E$6*10","v":0},{"$f":"PERCENTAGE!X46/eSUBMAR!$E$7*10","v":0},{"$f":"PERCENTAGE!Y46/eSUBMAR!$E$8*10","v":0},{"$f":"PERCENTAGE!Z46/eSUBMAR!$E$9*10","v":0},{"$f":"PERCENTAGE!AA46/eSUBMAR!$E$10*10","v":0},{"$f":"PERCENTAGE!AB46/eSUBMAR!$E$11*10","v":0}]
[{"$f":"eSPAR!A46","v":0},{"$f":"eSPAR!B46","v":0},{"$f":"PERCENTAGE!C47/eSUBMAR!$C$6*10","v":0},{"$f":"PERCENTAGE!D47/eSUBMAR!$C$7*10","v":0},{"$f":"PERCENTAGE!E47/eSUBMAR!$C$8*10","v":0},{"$f":"PERCENTAGE!F47/eSUBMAR!$C$9*10","v":0},{"$f":"PERCENTAGE!G47/eSUBMAR!$C$10*10","v":0},{"$f":"PERCENTAGE!H47/eSUBMAR!$C$11*10","v":0},null,null,null,null,{"$f":"PERCENTAGE!M47/eSUBMAR!$D$6*10","v":0},{"$f":"PERCENTAGE!N47/eSUBMAR!$D$7*10","v":0},{"$f":"PERCENTAGE!O47/eSUBMAR!$D$8*10","v":0},{"$f":"PERCENTAGE!P47/eSUBMAR!$D$9*10","v":0},{"$f":"PERCENTAGE!Q47/eSUBMAR!$D$10*10","v":0},{"$f":"PERCENTAGE!R47/eSUBMAR!$D$11*10","v":0},null,null,null,null,{"$f":"PERCENTAGE!W47/eSUBMAR!$E$6*10","v":0},{"$f":"PERCENTAGE!X47/eSUBMAR!$E$7*10","v":0},{"$f":"PERCENTAGE!Y47/eSUBMAR!$E$8*10","v":0},{"$f":"PERCENTAGE!Z47/eSUBMAR!$E$9*10","v":0},{"$f":"PERCENTAGE!AA47/eSUBMAR!$E$10*10","v":0},{"$f":"PERCENTAGE!AB47/eSUBMAR!$E$11*10","v":0}]
[{"$f":"eSPAR!A47","v":0},{"$f":"eSPAR!B47","v":0},{"$f":"PERCENTAGE!C48/eSUBMAR!$C$6*10","v":0},{"$f":"PERCENTAGE!D48/eSUBMAR!$C$7*10","v":0},{"$f":"PERCENTAGE!E48/eSUBMAR!$C$8*10","v":0},{"$f":"PERCENTAGE!F48/eSUBMAR!$C$9*10","v":0},{"$f":"PERCENTAGE!G48/eSUBMAR!$C$10*10","v":0},{"$f":"PERCENTAGE!H48/eSUBMAR!$C$11*10","v":0},null,null,null,null,{"$f":"PERCENTAGE!M48/eSUBMAR!$D$6*10","v":0},{"$f":"PERCENTAGE!N48/eSUBMAR!$D$7*10","v":0},{"$f":"PERCENTAGE!O48/eSUBMAR!$D$8*10","v":0},{"$f":"PERCENTAGE!P48/eSUBMAR!$D$9*10","v":0},{"$f":"PERCENTAGE!Q48/eSUBMAR!$D$10*10","v":0},{"$f":"PERCENTAGE!R48/eSUBMAR!$D$11*10","v":0},null,null,null,null,{"$f":"PERCENTAGE!W48/eSUBMAR!$E$6*10","v":0},{"$f":"PERCENTAGE!X48/eSUBMAR!$E$7*10","v":0},{"$f":"PERCENTAGE!Y48/eSUBMAR!$E$8*10","v":0},{"$f":"PERCENTAGE!Z48/eSUBMAR!$E$9*10","v":0},{"$f":"PERCENTAGE!AA48/eSUBMAR!$E$10*10","v":0},{"$f":"PERCENTAGE!AB48/eSUBMAR!$E$11*10","v":0}]
[{"$f":"eSPAR!A48","v":0},{"$f":"eSPAR!B48","v":0},{"$f":"PERCENTAGE!C49/eSUBMAR!$C$6*10","v":0},{"$f":"PERCENTAGE!D49/eSUBMAR!$C$7*10","v":0},{"$f":"PERCENTAGE!E49/eSUBMAR!$C$8*10","v":0},{"$f":"PERCENTAGE!F49/eSUBMAR!$C$9*10","v":0},{"$f":"PERCENTAGE!G49/eSUBMAR!$C$10*10","v":0},{"$f":"PERCENTAGE!H49/eSUBMAR!$C$11*10","v":0},null,null,null,null,{"$f":"PERCENTAGE!M49/eSUBMAR!$D$6*10","v":0},{"$f":"PERCENTAGE!N49/eSUBMAR!$D$7*10","v":0},{"$f":"PERCENTAGE!O49/eSUBMAR!$D$8*10","v":0},{"$f":"PERCENTAGE!P49/eSUBMAR!$D$9*10","v":0},{"$f":"PERCENTAGE!Q49/eSUBMAR!$D$10*10","v":0},{"$f":"PERCENTAGE!R49/eSUBMAR!$D$11*10","v":0},null,null,null,null,{"$f":"PERCENTAGE!W49/eSUBMAR!$E$6*10","v":0},{"$f":"PERCENTAGE!X49/eSUBMAR!$E$7*10","v":0},{"$f":"PERCENTAGE!Y49/eSUBMAR!$E$8*10","v":0},{"$f":"PERCENTAGE!Z49/eSUBMAR!$E$9*10","v":0},{"$f":"PERCENTAGE!AA49/eSUBMAR!$E$10*10","v":0},{"$f":"PERCENTAGE!AB49/eSUBMAR!$E$11*10","v":0}]
[{"$f":"eSPAR!A49","v":0},{"$f":"eSPAR!B49","v":0},{"$f":"PERCENTAGE!C50/eSUBMAR!$C$6*10","v":0},{"$f":"PERCENTAGE!D50/eSUBMAR!$C$7*10","v":0},{"$f":"PERCENTAGE!E50/eSUBMAR!$C$8*10","v":0},{"$f":"PERCENTAGE!F50/eSUBMAR!$C$9*10","v":0},{"$f":"PERCENTAGE!G50/eSUBMAR!$C$10*10","v":0},{"$f":"PERCENTAGE!H50/eSUBMAR!$C$11*10","v":0},null,null,null,null,{"$f":"PERCENTAGE!M50/eSUBMAR!$D$6*10","v":0},{"$f":"PERCENTAGE!N50/eSUBMAR!$D$7*10","v":0},{"$f":"PERCENTAGE!O50/eSUBMAR!$D$8*10","v":0},{"$f":"PERCENTAGE!P50/eSUBMAR!$D$9*10","v":0},{"$f":"PERCENTAGE!Q50/eSUBMAR!$D$10*10","v":0},{"$f":"PERCENTAGE!R50/eSUBMAR!$D$11*10","v":0},null,null,null,null,{"$f":"PERCENTAGE!W50/eSUBMAR!$E$6*10","v":0},{"$f":"PERCENTAGE!X50/eSUBMAR!$E$7*10","v":0},{"$f":"PERCENTAGE!Y50/eSUBMAR!$E$8*10","v":0},{"$f":"PERCENTAGE!Z50/eSUBMAR!$E$9*10","v":0},{"$f":"PERCENTAGE!AA50/eSUBMAR!$E$10*10","v":0},{"$f":"PERCENTAGE!AB50/eSUBMAR!$E$11*10","v":0}]
[{"$f":"eSPAR!A50","v":0},{"$f":"eSPAR!B50","v":0},{"$f":"PERCENTAGE!C51/eSUBMAR!$C$6*10","v":0},{"$f":"PERCENTAGE!D51/eSUBMAR!$C$7*10","v":0},{"$f":"PERCENTAGE!E51/eSUBMAR!$C$8*10","v":0},{"$f":"PERCENTAGE!F51/eSUBMAR!$C$9*10","v":0},{"$f":"PERCENTAGE!G51/eSUBMAR!$C$10*10","v":0},{"$f":"PERCENTAGE!H51/eSUBMAR!$C$11*10","v":0},null,null,null,null,{"$f":"PERCENTAGE!M51/eSUBMAR!$D$6*10","v":0},{"$f":"PERCENTAGE!N51/eSUBMAR!$D$7*10","v":0},{"$f":"PERCENTAGE!O51/eSUBMAR!$D$8*10","v":0},{"$f":"PERCENTAGE!P51/eSUBMAR!$D$9*10","v":0},{"$f":"PERCENTAGE!Q51/eSUBMAR!$D$10*10","v":0},{"$f":"PERCENTAGE!R51/eSUBMAR!$D$11*10","v":0},null,null,null,null,{"$f":"PERCENTAGE!W51/eSUBMAR!$E$6*10","v":0},{"$f":"PERCENTAGE!X51/eSUBMAR!$E$7*10","v":0},{"$f":"PERCENTAGE!Y51/eSUBMAR!$E$8*10","v":0},{"$f":"PERCENTAGE!Z51/eSUBMAR!$E$9*10","v":0},{"$f":"PERCENTAGE!AA51/eSUBMAR!$E$10*10","v":0},{"$f":"PERCENTAGE!AB51/eSUBMAR!$E$11*10","v":0}]
[{"$f":"eSPAR!A51","v":0},{"$f":"eSPAR!B51","v":0},{"$f":"PERCENTAGE!C52/eSUBMAR!$C$6*10","v":0},{"$f":"PERCENTAGE!D52/eSUBMAR!$C$7*10","v":0},{"$f":"PERCENTAGE!E52/eSUBMAR!$C$8*10","v":0},{"$f":"PERCENTAGE!F52/eSUBMAR!$C$9*10","v":0},{"$f":"PERCENTAGE!G52/eSUBMAR!$C$10*10","v":0},{"$f":"PERCENTAGE!H52/eSUBMAR!$C$11*10","v":0},null,null,null,null,{"$f":"PERCENTAGE!M52/eSUBMAR!$D$6*10","v":0},{"$f":"PERCENTAGE!N52/eSUBMAR!$D$7*10","v":0},{"$f":"PERCENTAGE!O52/eSUBMAR!$D$8*10","v":0},{"$f":"PERCENTAGE!P52/eSUBMAR!$D$9*10","v":0},{"$f":"PERCENTAGE!Q52/eSUBMAR!$D$10*10","v":0},{"$f":"PERCENTAGE!R52/eSUBMAR!$D$11*10","v":0},null,null,null,null,{"$f":"PERCENTAGE!W52/eSUBMAR!$E$6*10","v":0},{"$f":"PERCENTAGE!X52/eSUBMAR!$E$7*10","v":0},{"$f":"PERCENTAGE!Y52/eSUBMAR!$E$8*10","v":0},{"$f":"PERCENTAGE!Z52/eSUBMAR!$E$9*10","v":0},{"$f":"PERCENTAGE!AA52/eSUBMAR!$E$10*10","v":0},{"$f":"PERCENTAGE!AB52/eSUBMAR!$E$11*10","v":0}]
[{"$f":"eSPAR!A52","v":0},{"$f":"eSPAR!B52","v":0},{"$f":"PERCENTAGE!C53/eSUBMAR!$C$6*10","v":0},{"$f":"PERCENTAGE!D53/eSUBMAR!$C$7*10","v":0},{"$f":"PERCENTAGE!E53/eSUBMAR!$C$8*10","v":0},{"$f":"PERCENTAGE!F53/eSUBMAR!$C$9*10","v":0},{"$f":"PERCENTAGE!G53/eSUBMAR!$C$10*10","v":0},{"$f":"PERCENTAGE!H53/eSUBMAR!$C$11*10","v":0},null,null,null,null,{"$f":"PERCENTAGE!M53/eSUBMAR!$D$6*10","v":0},{"$f":"PERCENTAGE!N53/eSUBMAR!$D$7*10","v":0},{"$f":"PERCENTAGE!O53/eSUBMAR!$D$8*10","v":0},{"$f":"PERCENTAGE!P53/eSUBMAR!$D$9*10","v":0},{"$f":"PERCENTAGE!Q53/eSUBMAR!$D$10*10","v":0},{"$f":"PERCENTAGE!R53/eSUBMAR!$D$11*10","v":0},null,null,null,null,{"$f":"PERCENTAGE!W53/eSUBMAR!$E$6*10","v":0},{"$f":"PERCENTAGE!X53/eSUBMAR!$E$7*10","v":0},{"$f":"PERCENTAGE!Y53/eSUBMAR!$E$8*10","v":0},{"$f":"PERCENTAGE!Z53/eSUBMAR!$E$9*10","v":0},{"$f":"PERCENTAGE!AA53/eSUBMAR!$E$10*10","v":0},{"$f":"PERCENTAGE!AB53/eSUBMAR!$E$11*10","v":0}]
[{"$f":"eSPAR!A53","v":0},{"$f":"eSPAR!B53","v":0},{"$f":"PERCENTAGE!C54/eSUBMAR!$C$6*10","v":0},{"$f":"PERCENTAGE!D54/eSUBMAR!$C$7*10","v":0},{"$f":"PERCENTAGE!E54/eSUBMAR!$C$8*10","v":0},{"$f":"PERCENTAGE!F54/eSUBMAR!$C$9*10","v":0},{"$f":"PERCENTAGE!G54/eSUBMAR!$C$10*10","v":0},{"$f":"PERCENTAGE!H54/eSUBMAR!$C$11*10","v":0},null,null,null,null,{"$f":"PERCENTAGE!M54/eSUBMAR!$D$6*10","v":0},{"$f":"PERCENTAGE!N54/eSUBMAR!$D$7*10","v":0},{"$f":"PERCENTAGE!O54/eSUBMAR!$D$8*10","v":0},{"$f":"PERCENTAGE!P54/eSUBMAR!$D$9*10","v":0},{"$f":"PERCENTAGE!Q54/eSUBMAR!$D$10*10","v":0},{"$f":"PERCENTAGE!R54/eSUBMAR!$D$11*10","v":0},null,null,null,null,{"$f":"PERCENTAGE!W54/eSUBMAR!$E$6*10","v":0},{"$f":"PERCENTAGE!X54/eSUBMAR!$E$7*10","v":0},{"$f":"PERCENTAGE!Y54/eSUBMAR!$E$8*10","v":0},{"$f":"PERCENTAGE!Z54/eSUBMAR!$E$9*10","v":0},{"$f":"PERCENTAGE!AA54/eSUBMAR!$E$10*10","v":0},{"$f":"PERCENTAGE!AB54/eSUBMAR!$E$11*10","v":0}]
[{"$f":"eSPAR!A54","v":0},{"$f":"eSPAR!B54","v":0},{"$f":"PERCENTAGE!C55/eSUBMAR!$C$6*10","v":0},{"$f":"PERCENTAGE!D55/eSUBMAR!$C$7*10","v":0},{"$f":"PERCENTAGE!E55/eSUBMAR!$C$8*10","v":0},{"$f":"PERCENTAGE!F55/eSUBMAR!$C$9*10","v":0},{"$f":"PERCENTAGE!G55/eSUBMAR!$C$10*10","v":0},{"$f":"PERCENTAGE!H55/eSUBMAR!$C$11*10","v":0},null,null,null,null,{"$f":"PERCENTAGE!M55/eSUBMAR!$D$6*10","v":0},{"$f":"PERCENTAGE!N55/eSUBMAR!$D$7*10","v":0},{"$f":"PERCENTAGE!O55/eSUBMAR!$D$8*10","v":0},{"$f":"PERCENTAGE!P55/eSUBMAR!$D$9*10","v":0},{"$f":"PERCENTAGE!Q55/eSUBMAR!$D$10*10","v":0},{"$f":"PERCENTAGE!R55/eSUBMAR!$D$11*10","v":0},null,null,null,null,{"$f":"PERCENTAGE!W55/eSUBMAR!$E$6*10","v":0},{"$f":"PERCENTAGE!X55/eSUBMAR!$E$7*10","v":0},{"$f":"PERCENTAGE!Y55/eSUBMAR!$E$8*10","v":0},{"$f":"PERCENTAGE!Z55/eSUBMAR!$E$9*10","v":0},{"$f":"PERCENTAGE!AA55/eSUBMAR!$E$10*10","v":0},{"$f":"PERCENTAGE!AB55/eSUBMAR!$E$11*10","v":0}]
[{"$f":"eSPAR!A55","v":0},{"$f":"eSPAR!B55","v":0},{"$f":"PERCENTAGE!C56/eSUBMAR!$C$6*10","v":0},{"$f":"PERCENTAGE!D56/eSUBMAR!$C$7*10","v":0},{"$f":"PERCENTAGE!E56/eSUBMAR!$C$8*10","v":0},{"$f":"PERCENTAGE!F56/eSUBMAR!$C$9*10","v":0},{"$f":"PERCENTAGE!G56/eSUBMAR!$C$10*10","v":0},{"$f":"PERCENTAGE!H56/eSUBMAR!$C$11*10","v":0},null,null,null,null,{"$f":"PERCENTAGE!M56/eSUBMAR!$D$6*10","v":0},{"$f":"PERCENTAGE!N56/eSUBMAR!$D$7*10","v":0},{"$f":"PERCENTAGE!O56/eSUBMAR!$D$8*10","v":0},{"$f":"PERCENTAGE!P56/eSUBMAR!$D$9*10","v":0},{"$f":"PERCENTAGE!Q56/eSUBMAR!$D$10*10","v":0},{"$f":"PERCENTAGE!R56/eSUBMAR!$D$11*10","v":0},null,null,null,null,{"$f":"PERCENTAGE!W56/eSUBMAR!$E$6*10","v":0},{"$f":"PERCENTAGE!X56/eSUBMAR!$E$7*10","v":0},{"$f":"PERCENTAGE!Y56/eSUBMAR!$E$8*10","v":0},{"$f":"PERCENTAGE!Z56/eSUBMAR!$E$9*10","v":0},{"$f":"PERCENTAGE!AA56/eSUBMAR!$E$10*10","v":0},{"$f":"PERCENTAGE!AB56/eSUBMAR!$E$11*10","v":0}]
[{"$f":"eSPAR!A56","v":0},{"$f":"eSPAR!B56","v":0},{"$f":"PERCENTAGE!C57/eSUBMAR!$C$6*10","v":0},{"$f":"PERCENTAGE!D57/eSUBMAR!$C$7*10","v":0},{"$f":"PERCENTAGE!E57/eSUBMAR!$C$8*10","v":0},{"$f":"PERCENTAGE!F57/eSUBMAR!$C$9*10","v":0},{"$f":"PERCENTAGE!G57/eSUBMAR!$C$10*10","v":0},{"$f":"PERCENTAGE!H57/eSUBMAR!$C$11*10","v":0},null,null,null,null,{"$f":"PERCENTAGE!M57/eSUBMAR!$D$6*10","v":0},{"$f":"PERCENTAGE!N57/eSUBMAR!$D$7*10","v":0},{"$f":"PERCENTAGE!O57/eSUBMAR!$D$8*10","v":0},{"$f":"PERCENTAGE!P57/eSUBMAR!$D$9*10","v":0},{"$f":"PERCENTAGE!Q57/eSUBMAR!$D$10*10","v":0},{"$f":"PERCENTAGE!R57/eSUBMAR!$D$11*10","v":0},null,null,null,null,{"$f":"PERCENTAGE!W57/eSUBMAR!$E$6*10","v":0},{"$f":"PERCENTAGE!X57/eSUBMAR!$E$7*10","v":0},{"$f":"PERCENTAGE!Y57/eSUBMAR!$E$8*10","v":0},{"$f":"PERCENTAGE!Z57/eSUBMAR!$E$9*10","v":0},{"$f":"PERCENTAGE!AA57/eSUBMAR!$E$10*10","v":0},{"$f":"PERCENTAGE!AB57/eSUBMAR!$E$11*10","v":0}]
[{"$f":"eSPAR!A57","v":0},{"$f":"eSPAR!B57","v":0},{"$f":"PERCENTAGE!C58/eSUBMAR!$C$6*10","v":0},{"$f":"PERCENTAGE!D58/eSUBMAR!$C$7*10","v":0},{"$f":"PERCENTAGE!E58/eSUBMAR!$C$8*10","v":0},{"$f":"PERCENTAGE!F58/eSUBMAR!$C$9*10","v":0},{"$f":"PERCENTAGE!G58/eSUBMAR!$C$10*10","v":0},{"$f":"PERCENTAGE!H58/eSUBMAR!$C$11*10","v":0},null,null,null,null,{"$f":"PERCENTAGE!M58/eSUBMAR!$D$6*10","v":0},{"$f":"PERCENTAGE!N58/eSUBMAR!$D$7*10","v":0},{"$f":"PERCENTAGE!O58/eSUBMAR!$D$8*10","v":0},{"$f":"PERCENTAGE!P58/eSUBMAR!$D$9*10","v":0},{"$f":"PERCENTAGE!Q58/eSUBMAR!$D$10*10","v":0},{"$f":"PERCENTAGE!R58/eSUBMAR!$D$11*10","v":0},null,null,null,null,{"$f":"PERCENTAGE!W58/eSUBMAR!$E$6*10","v":0},{"$f":"PERCENTAGE!X58/eSUBMAR!$E$7*10","v":0},{"$f":"PERCENTAGE!Y58/eSUBMAR!$E$8*10","v":0},{"$f":"PERCENTAGE!Z58/eSUBMAR!$E$9*10","v":0},{"$f":"PERCENTAGE!AA58/eSUBMAR!$E$10*10","v":0},{"$f":"PERCENTAGE!AB58/eSUBMAR!$E$11*10","v":0}]
[{"$f":"eSPAR!A58","v":0},{"$f":"eSPAR!B58","v":0},{"$f":"PERCENTAGE!C59/eSUBMAR!$C$6*10","v":0},{"$f":"PERCENTAGE!D59/eSUBMAR!$C$7*10","v":0},{"$f":"PERCENTAGE!E59/eSUBMAR!$C$8*10","v":0},{"$f":"PERCENTAGE!F59/eSUBMAR!$C$9*10","v":0},{"$f":"PERCENTAGE!G59/eSUBMAR!$C$10*10","v":0},{"$f":"PERCENTAGE!H59/eSUBMAR!$C$11*10","v":0},null,null,null,null,{"$f":"PERCENTAGE!M59/eSUBMAR!$D$6*10","v":0},{"$f":"PERCENTAGE!N59/eSUBMAR!$D$7*10","v":0},{"$f":"PERCENTAGE!O59/eSUBMAR!$D$8*10","v":0},{"$f":"PERCENTAGE!P59/eSUBMAR!$D$9*10","v":0},{"$f":"PERCENTAGE!Q59/eSUBMAR!$D$10*10","v":0},{"$f":"PERCENTAGE!R59/eSUBMAR!$D$11*10","v":0},null,null,null,null,{"$f":"PERCENTAGE!W59/eSUBMAR!$E$6*10","v":0},{"$f":"PERCENTAGE!X59/eSUBMAR!$E$7*10","v":0},{"$f":"PERCENTAGE!Y59/eSUBMAR!$E$8*10","v":0},{"$f":"PERCENTAGE!Z59/eSUBMAR!$E$9*10","v":0},{"$f":"PERCENTAGE!AA59/eSUBMAR!$E$10*10","v":0},{"$f":"PERCENTAGE!AB59/eSUBMAR!$E$11*10","v":0}]
[{"$f":"eSPAR!A59","v":0},{"$f":"eSPAR!B59","v":0},{"$f":"PERCENTAGE!C60/eSUBMAR!$C$6*10","v":0},{"$f":"PERCENTAGE!D60/eSUBMAR!$C$7*10","v":0},{"$f":"PERCENTAGE!E60/eSUBMAR!$C$8*10","v":0},{"$f":"PERCENTAGE!F60/eSUBMAR!$C$9*10","v":0},{"$f":"PERCENTAGE!G60/eSUBMAR!$C$10*10","v":0},{"$f":"PERCENTAGE!H60/eSUBMAR!$C$11*10","v":0},null,null,null,null,{"$f":"PERCENTAGE!M60/eSUBMAR!$D$6*10","v":0},{"$f":"PERCENTAGE!N60/eSUBMAR!$D$7*10","v":0},{"$f":"PERCENTAGE!O60/eSUBMAR!$D$8*10","v":0},{"$f":"PERCENTAGE!P60/eSUBMAR!$D$9*10","v":0},{"$f":"PERCENTAGE!Q60/eSUBMAR!$D$10*10","v":0},{"$f":"PERCENTAGE!R60/eSUBMAR!$D$11*10","v":0},null,null,null,null,{"$f":"PERCENTAGE!W60/eSUBMAR!$E$6*10","v":0},{"$f":"PERCENTAGE!X60/eSUBMAR!$E$7*10","v":0},{"$f":"PERCENTAGE!Y60/eSUBMAR!$E$8*10","v":0},{"$f":"PERCENTAGE!Z60/eSUBMAR!$E$9*10","v":0},{"$f":"PERCENTAGE!AA60/eSUBMAR!$E$10*10","v":0},{"$f":"PERCENTAGE!AB60/eSUBMAR!$E$11*10","v":0}]
[{"$f":"eSPAR!A60","v":0},{"$f":"eSPAR!B60","v":0},{"$f":"PERCENTAGE!C61/eSUBMAR!$C$6*10","v":0},{"$f":"PERCENTAGE!D61/eSUBMAR!$C$7*10","v":0},{"$f":"PERCENTAGE!E61/eSUBMAR!$C$8*10","v":0},{"$f":"PERCENTAGE!F61/eSUBMAR!$C$9*10","v":0},{"$f":"PERCENTAGE!G61/eSUBMAR!$C$10*10","v":0},{"$f":"PERCENTAGE!H61/eSUBMAR!$C$11*10","v":0},null,null,null,null,{"$f":"PERCENTAGE!M61/eSUBMAR!$D$6*10","v":0},{"$f":"PERCENTAGE!N61/eSUBMAR!$D$7*10","v":0},{"$f":"PERCENTAGE!O61/eSUBMAR!$D$8*10","v":0},{"$f":"PERCENTAGE!P61/eSUBMAR!$D$9*10","v":0},{"$f":"PERCENTAGE!Q61/eSUBMAR!$D$10*10","v":0},{"$f":"PERCENTAGE!R61/eSUBMAR!$D$11*10","v":0},null,null,null,null,{"$f":"PERCENTAGE!W61/eSUBMAR!$E$6*10","v":0},{"$f":"PERCENTAGE!X61/eSUBMAR!$E$7*10","v":0},{"$f":"PERCENTAGE!Y61/eSUBMAR!$E$8*10","v":0},{"$f":"PERCENTAGE!Z61/eSUBMAR!$E$9*10","v":0},{"$f":"PERCENTAGE!AA61/eSUBMAR!$E$10*10","v":0},{"$f":"PERCENTAGE!AB61/eSUBMAR!$E$11*10","v":0}]
[{"$f":"eSPAR!A61","v":0},{"$f":"eSPAR!B61","v":0},{"$f":"PERCENTAGE!C62/eSUBMAR!$C$6*10","v":0},{"$f":"PERCENTAGE!D62/eSUBMAR!$C$7*10","v":0},{"$f":"PERCENTAGE!E62/eSUBMAR!$C$8*10","v":0},{"$f":"PERCENTAGE!F62/eSUBMAR!$C$9*10","v":0},{"$f":"PERCENTAGE!G62/eSUBMAR!$C$10*10","v":0},{"$f":"PERCENTAGE!H62/eSUBMAR!$C$11*10","v":0},null,null,null,null,{"$f":"PERCENTAGE!M62/eSUBMAR!$D$6*10","v":0},{"$f":"PERCENTAGE!N62/eSUBMAR!$D$7*10","v":0},{"$f":"PERCENTAGE!O62/eSUBMAR!$D$8*10","v":0},{"$f":"PERCENTAGE!P62/eSUBMAR!$D$9*10","v":0},{"$f":"PERCENTAGE!Q62/eSUBMAR!$D$10*10","v":0},{"$f":"PERCENTAGE!R62/eSUBMAR!$D$11*10","v":0},null,null,null,null,{"$f":"PERCENTAGE!W62/eSUBMAR!$E$6*10","v":0},{"$f":"PERCENTAGE!X62/eSUBMAR!$E$7*10","v":0},{"$f":"PERCENTAGE!Y62/eSUBMAR!$E$8*10","v":0},{"$f":"PERCENTAGE!Z62/eSUBMAR!$E$9*10","v":0},{"$f":"PERCENTAGE!AA62/eSUBMAR!$E$10*10","v":0},{"$f":"PERCENTAGE!AB62/eSUBMAR!$E$11*10","v":0}]
[{"$f":"eSPAR!A62","v":0},{"$f":"eSPAR!B62","v":0},{"$f":"PERCENTAGE!C63/eSUBMAR!$C$6*10","v":0},{"$f":"PERCENTAGE!D63/eSUBMAR!$C$7*10","v":0},{"$f":"PERCENTAGE!E63/eSUBMAR!$C$8*10","v":0},{"$f":"PERCENTAGE!F63/eSUBMAR!$C$9*10","v":0},{"$f":"PERCENTAGE!G63/eSUBMAR!$C$10*10","v":0},{"$f":"PERCENTAGE!H63/eSUBMAR!$C$11*10","v":0},null,null,null,null,{"$f":"PERCENTAGE!M63/eSUBMAR!$D$6*10","v":0},{"$f":"PERCENTAGE!N63/eSUBMAR!$D$7*10","v":0},{"$f":"PERCENTAGE!O63/eSUBMAR!$D$8*10","v":0},{"$f":"PERCENTAGE!P63/eSUBMAR!$D$9*10","v":0},{"$f":"PERCENTAGE!Q63/eSUBMAR!$D$10*10","v":0},{"$f":"PERCENTAGE!R63/eSUBMAR!$D$11*10","v":0},null,null,null,null,{"$f":"PERCENTAGE!W63/eSUBMAR!$E$6*10","v":0},{"$f":"PERCENTAGE!X63/eSUBMAR!$E$7*10","v":0},{"$f":"PERCENTAGE!Y63/eSUBMAR!$E$8*10","v":0},{"$f":"PERCENTAGE!Z63/eSUBMAR!$E$9*10","v":0},{"$f":"PERCENTAGE!AA63/eSUBMAR!$E$10*10","v":0},{"$f":"PERCENTAGE!AB63/eSUBMAR!$E$11*10","v":0}]
[{"$f":"eSPAR!A63","v":0},{"$f":"eSPAR!B63","v":0},{"$f":"PERCENTAGE!C64/eSUBMAR!$C$6*10","v":0},{"$f":"PERCENTAGE!D64/eSUBMAR!$C$7*10","v":0},{"$f":"PERCENTAGE!E64/eSUBMAR!$C$8*10","v":0},{"$f":"PERCENTAGE!F64/eSUBMAR!$C$9*10","v":0},{"$f":"PERCENTAGE!G64/eSUBMAR!$C$10*10","v":0},{"$f":"PERCENTAGE!H64/eSUBMAR!$C$11*10","v":0},null,null,null,null,{"$f":"PERCENTAGE!M64/eSUBMAR!$D$6*10","v":0},{"$f":"PERCENTAGE!N64/eSUBMAR!$D$7*10","v":0},{"$f":"PERCENTAGE!O64/eSUBMAR!$D$8*10","v":0},{"$f":"PERCENTAGE!P64/eSUBMAR!$D$9*10","v":0},{"$f":"PERCENTAGE!Q64/eSUBMAR!$D$10*10","v":0},{"$f":"PERCENTAGE!R64/eSUBMAR!$D$11*10","v":0},null,null,null,null,{"$f":"PERCENTAGE!W64/eSUBMAR!$E$6*10","v":0},{"$f":"PERCENTAGE!X64/eSUBMAR!$E$7*10","v":0},{"$f":"PERCENTAGE!Y64/eSUBMAR!$E$8*10","v":0},{"$f":"PERCENTAGE!Z64/eSUBMAR!$E$9*10","v":0},{"$f":"PERCENTAGE!AA64/eSUBMAR!$E$10*10","v":0},{"$f":"PERCENTAGE!AB64/eSUBMAR!$E$11*10","v":0}]
[{"$f":"eSPAR!A64","v":0},{"$f":"eSPAR!B64","v":0},{"$f":"PERCENTAGE!C65/eSUBMAR!$C$6*10","v":0},{"$f":"PERCENTAGE!D65/eSUBMAR!$C$7*10","v":0},{"$f":"PERCENTAGE!E65/eSUBMAR!$C$8*10","v":0},{"$f":"PERCENTAGE!F65/eSUBMAR!$C$9*10","v":0},{"$f":"PERCENTAGE!G65/eSUBMAR!$C$10*10","v":0},{"$f":"PERCENTAGE!H65/eSUBMAR!$C$11*10","v":0},null,null,null,null,{"$f":"PERCENTAGE!M65/eSUBMAR!$D$6*10","v":0},{"$f":"PERCENTAGE!N65/eSUBMAR!$D$7*10","v":0},{"$f":"PERCENTAGE!O65/eSUBMAR!$D$8*10","v":0},{"$f":"PERCENTAGE!P65/eSUBMAR!$D$9*10","v":0},{"$f":"PERCENTAGE!Q65/eSUBMAR!$D$10*10","v":0},{"$f":"PERCENTAGE!R65/eSUBMAR!$D$11*10","v":0},null,null,null,null,{"$f":"PERCENTAGE!W65/eSUBMAR!$E$6*10","v":0},{"$f":"PERCENTAGE!X65/eSUBMAR!$E$7*10","v":0},{"$f":"PERCENTAGE!Y65/eSUBMAR!$E$8*10","v":0},{"$f":"PERCENTAGE!Z65/eSUBMAR!$E$9*10","v":0},{"$f":"PERCENTAGE!AA65/eSUBMAR!$E$10*10","v":0},{"$f":"PERCENTAGE!AB65/eSUBMAR!$E$11*10","v":0}]
[{"$f":"eSPAR!A65","v":0},{"$f":"eSPAR!B65","v":0},{"$f":"PERCENTAGE!C66/eSUBMAR!$C$6*10","v":0},{"$f":"PERCENTAGE!D66/eSUBMAR!$C$7*10","v":0},{"$f":"PERCENTAGE!E66/eSUBMAR!$C$8*10","v":0},{"$f":"PERCENTAGE!F66/eSUBMAR!$C$9*10","v":0},{"$f":"PERCENTAGE!G66/eSUBMAR!$C$10*10","v":0},{"$f":"PERCENTAGE!H66/eSUBMAR!$C$11*10","v":0},null,null,null,null,{"$f":"PERCENTAGE!M66/eSUBMAR!$D$6*10","v":0},{"$f":"PERCENTAGE!N66/eSUBMAR!$D$7*10","v":0},{"$f":"PERCENTAGE!O66/eSUBMAR!$D$8*10","v":0},{"$f":"PERCENTAGE!P66/eSUBMAR!$D$9*10","v":0},{"$f":"PERCENTAGE!Q66/eSUBMAR!$D$10*10","v":0},{"$f":"PERCENTAGE!R66/eSUBMAR!$D$11*10","v":0},null,null,null,null,{"$f":"PERCENTAGE!W66/eSUBMAR!$E$6*10","v":0},{"$f":"PERCENTAGE!X66/eSUBMAR!$E$7*10","v":0},{"$f":"PERCENTAGE!Y66/eSUBMAR!$E$8*10","v":0},{"$f":"PERCENTAGE!Z66/eSUBMAR!$E$9*10","v":0},{"$f":"PERCENTAGE!AA66/eSUBMAR!$E$10*10","v":0},{"$f":"PERCENTAGE!AB66/eSUBMAR!$E$11*10","v":0}]
[{"$f":"eSPAR!A66","v":0},{"$f":"eSPAR!B66","v":0},{"$f":"PERCENTAGE!C67/eSUBMAR!$C$6*10","v":0},{"$f":"PERCENTAGE!D67/eSUBMAR!$C$7*10","v":0},{"$f":"PERCENTAGE!E67/eSUBMAR!$C$8*10","v":0},{"$f":"PERCENTAGE!F67/eSUBMAR!$C$9*10","v":0},{"$f":"PERCENTAGE!G67/eSUBMAR!$C$10*10","v":0},{"$f":"PERCENTAGE!H67/eSUBMAR!$C$11*10","v":0},null,null,null,null,{"$f":"PERCENTAGE!M67/eSUBMAR!$D$6*10","v":0},{"$f":"PERCENTAGE!N67/eSUBMAR!$D$7*10","v":0},{"$f":"PERCENTAGE!O67/eSUBMAR!$D$8*10","v":0},{"$f":"PERCENTAGE!P67/eSUBMAR!$D$9*10","v":0},{"$f":"PERCENTAGE!Q67/eSUBMAR!$D$10*10","v":0},{"$f":"PERCENTAGE!R67/eSUBMAR!$D$11*10","v":0},null,null,null,null,{"$f":"PERCENTAGE!W67/eSUBMAR!$E$6*10","v":0},{"$f":"PERCENTAGE!X67/eSUBMAR!$E$7*10","v":0},{"$f":"PERCENTAGE!Y67/eSUBMAR!$E$8*10","v":0},{"$f":"PERCENTAGE!Z67/eSUBMAR!$E$9*10","v":0},{"$f":"PERCENTAGE!AA67/eSUBMAR!$E$10*10","v":0},{"$f":"PERCENTAGE!AB67/eSUBMAR!$E$11*10","v":0}]
[{"$f":"eSPAR!A67","v":0},{"$f":"eSPAR!B67","v":0},{"$f":"PERCENTAGE!C68/eSUBMAR!$C$6*10","v":0},{"$f":"PERCENTAGE!D68/eSUBMAR!$C$7*10","v":0},{"$f":"PERCENTAGE!E68/eSUBMAR!$C$8*10","v":0},{"$f":"PERCENTAGE!F68/eSUBMAR!$C$9*10","v":0},{"$f":"PERCENTAGE!G68/eSUBMAR!$C$10*10","v":0},{"$f":"PERCENTAGE!H68/eSUBMAR!$C$11*10","v":0},null,null,null,null,{"$f":"PERCENTAGE!M68/eSUBMAR!$D$6*10","v":0},{"$f":"PERCENTAGE!N68/eSUBMAR!$D$7*10","v":0},{"$f":"PERCENTAGE!O68/eSUBMAR!$D$8*10","v":0},{"$f":"PERCENTAGE!P68/eSUBMAR!$D$9*10","v":0},{"$f":"PERCENTAGE!Q68/eSUBMAR!$D$10*10","v":0},{"$f":"PERCENTAGE!R68/eSUBMAR!$D$11*10","v":0},null,null,null,null,{"$f":"PERCENTAGE!W68/eSUBMAR!$E$6*10","v":0},{"$f":"PERCENTAGE!X68/eSUBMAR!$E$7*10","v":0},{"$f":"PERCENTAGE!Y68/eSUBMAR!$E$8*10","v":0},{"$f":"PERCENTAGE!Z68/eSUBMAR!$E$9*10","v":0},{"$f":"PERCENTAGE!AA68/eSUBMAR!$E$10*10","v":0},{"$f":"PERCENTAGE!AB68/eSUBMAR!$E$11*10","v":0}]
[{"$f":"eSPAR!A68","v":0},{"$f":"eSPAR!B68","v":0},{"$f":"PERCENTAGE!C69/eSUBMAR!$C$6*10","v":0},{"$f":"PERCENTAGE!D69/eSUBMAR!$C$7*10","v":0},{"$f":"PERCENTAGE!E69/eSUBMAR!$C$8*10","v":0},{"$f":"PERCENTAGE!F69/eSUBMAR!$C$9*10","v":0},{"$f":"PERCENTAGE!G69/eSUBMAR!$C$10*10","v":0},{"$f":"PERCENTAGE!H69/eSUBMAR!$C$11*10","v":0},null,null,null,null,{"$f":"PERCENTAGE!M69/eSUBMAR!$D$6*10","v":0},{"$f":"PERCENTAGE!N69/eSUBMAR!$D$7*10","v":0},{"$f":"PERCENTAGE!O69/eSUBMAR!$D$8*10","v":0},{"$f":"PERCENTAGE!P69/eSUBMAR!$D$9*10","v":0},{"$f":"PERCENTAGE!Q69/eSUBMAR!$D$10*10","v":0},{"$f":"PERCENTAGE!R69/eSUBMAR!$D$11*10","v":0},null,null,null,null,{"$f":"PERCENTAGE!W69/eSUBMAR!$E$6*10","v":0},{"$f":"PERCENTAGE!X69/eSUBMAR!$E$7*10","v":0},{"$f":"PERCENTAGE!Y69/eSUBMAR!$E$8*10","v":0},{"$f":"PERCENTAGE!Z69/eSUBMAR!$E$9*10","v":0},{"$f":"PERCENTAGE!AA69/eSUBMAR!$E$10*10","v":0},{"$f":"PERCENTAGE!AB69/eSUBMAR!$E$11*10","v":0}]
[{"$f":"eSPAR!A69","v":0},{"$f":"eSPAR!B69","v":0},{"$f":"PERCENTAGE!C70/eSUBMAR!$C$6*10","v":0},{"$f":"PERCENTAGE!D70/eSUBMAR!$C$7*10","v":0},{"$f":"PERCENTAGE!E70/eSUBMAR!$C$8*10","v":0},{"$f":"PERCENTAGE!F70/eSUBMAR!$C$9*10","v":0},{"$f":"PERCENTAGE!G70/eSUBMAR!$C$10*10","v":0},{"$f":"PERCENTAGE!H70/eSUBMAR!$C$11*10","v":0},null,null,null,null,{"$f":"PERCENTAGE!M70/eSUBMAR!$D$6*10","v":0},{"$f":"PERCENTAGE!N70/eSUBMAR!$D$7*10","v":0},{"$f":"PERCENTAGE!O70/eSUBMAR!$D$8*10","v":0},{"$f":"PERCENTAGE!P70/eSUBMAR!$D$9*10","v":0},{"$f":"PERCENTAGE!Q70/eSUBMAR!$D$10*10","v":0},{"$f":"PERCENTAGE!R70/eSUBMAR!$D$11*10","v":0},null,null,null,null,{"$f":"PERCENTAGE!W70/eSUBMAR!$E$6*10","v":0},{"$f":"PERCENTAGE!X70/eSUBMAR!$E$7*10","v":0},{"$f":"PERCENTAGE!Y70/eSUBMAR!$E$8*10","v":0},{"$f":"PERCENTAGE!Z70/eSUBMAR!$E$9*10","v":0},{"$f":"PERCENTAGE!AA70/eSUBMAR!$E$10*10","v":0},{"$f":"PERCENTAGE!AB70/eSUBMAR!$E$11*10","v":0}]
[{"$f":"eSPAR!A70","v":0},{"$f":"eSPAR!B70","v":0},{"$f":"PERCENTAGE!C71/eSUBMAR!$C$6*10","v":0},{"$f":"PERCENTAGE!D71/eSUBMAR!$C$7*10","v":0},{"$f":"PERCENTAGE!E71/eSUBMAR!$C$8*10","v":0},{"$f":"PERCENTAGE!F71/eSUBMAR!$C$9*10","v":0},{"$f":"PERCENTAGE!G71/eSUBMAR!$C$10*10","v":0},{"$f":"PERCENTAGE!H71/eSUBMAR!$C$11*10","v":0},null,null,null,null,{"$f":"PERCENTAGE!M71/eSUBMAR!$D$6*10","v":0},{"$f":"PERCENTAGE!N71/eSUBMAR!$D$7*10","v":0},{"$f":"PERCENTAGE!O71/eSUBMAR!$D$8*10","v":0},{"$f":"PERCENTAGE!P71/eSUBMAR!$D$9*10","v":0},{"$f":"PERCENTAGE!Q71/eSUBMAR!$D$10*10","v":0},{"$f":"PERCENTAGE!R71/eSUBMAR!$D$11*10","v":0},null,null,null,null,{"$f":"PERCENTAGE!W71/eSUBMAR!$E$6*10","v":0},{"$f":"PERCENTAGE!X71/eSUBMAR!$E$7*10","v":0},{"$f":"PERCENTAGE!Y71/eSUBMAR!$E$8*10","v":0},{"$f":"PERCENTAGE!Z71/eSUBMAR!$E$9*10","v":0},{"$f":"PERCENTAGE!AA71/eSUBMAR!$E$10*10","v":0},{"$f":"PERCENTAGE!AB71/eSUBMAR!$E$11*10","v":0}]
[{"$f":"eSPAR!A71","v":0},{"$f":"eSPAR!B71","v":0},{"$f":"PERCENTAGE!C72/eSUBMAR!$C$6*10","v":0},{"$f":"PERCENTAGE!D72/eSUBMAR!$C$7*10","v":0},{"$f":"PERCENTAGE!E72/eSUBMAR!$C$8*10","v":0},{"$f":"PERCENTAGE!F72/eSUBMAR!$C$9*10","v":0},{"$f":"PERCENTAGE!G72/eSUBMAR!$C$10*10","v":0},{"$f":"PERCENTAGE!H72/eSUBMAR!$C$11*10","v":0},null,null,null,null,{"$f":"PERCENTAGE!M72/eSUBMAR!$D$6*10","v":0},{"$f":"PERCENTAGE!N72/eSUBMAR!$D$7*10","v":0},{"$f":"PERCENTAGE!O72/eSUBMAR!$D$8*10","v":0},{"$f":"PERCENTAGE!P72/eSUBMAR!$D$9*10","v":0},{"$f":"PERCENTAGE!Q72/eSUBMAR!$D$10*10","v":0},{"$f":"PERCENTAGE!R72/eSUBMAR!$D$11*10","v":0},null,null,null,null,{"$f":"PERCENTAGE!W72/eSUBMAR!$E$6*10","v":0},{"$f":"PERCENTAGE!X72/eSUBMAR!$E$7*10","v":0},{"$f":"PERCENTAGE!Y72/eSUBMAR!$E$8*10","v":0},{"$f":"PERCENTAGE!Z72/eSUBMAR!$E$9*10","v":0},{"$f":"PERCENTAGE!AA72/eSUBMAR!$E$10*10","v":0},{"$f":"PERCENTAGE!AB72/eSUBMAR!$E$11*10","v":0}]
[{"$f":"eSPAR!A72","v":0},{"$f":"eSPAR!B72","v":0},{"$f":"PERCENTAGE!C73/eSUBMAR!$C$6*10","v":0},{"$f":"PERCENTAGE!D73/eSUBMAR!$C$7*10","v":0},{"$f":"PERCENTAGE!E73/eSUBMAR!$C$8*10","v":0},{"$f":"PERCENTAGE!F73/eSUBMAR!$C$9*10","v":0},{"$f":"PERCENTAGE!G73/eSUBMAR!$C$10*10","v":0},{"$f":"PERCENTAGE!H73/eSUBMAR!$C$11*10","v":0},null,null,null,null,{"$f":"PERCENTAGE!M73/eSUBMAR!$D$6*10","v":0},{"$f":"PERCENTAGE!N73/eSUBMAR!$D$7*10","v":0},{"$f":"PERCENTAGE!O73/eSUBMAR!$D$8*10","v":0},{"$f":"PERCENTAGE!P73/eSUBMAR!$D$9*10","v":0},{"$f":"PERCENTAGE!Q73/eSUBMAR!$D$10*10","v":0},{"$f":"PERCENTAGE!R73/eSUBMAR!$D$11*10","v":0},null,null,null,null,{"$f":"PERCENTAGE!W73/eSUBMAR!$E$6*10","v":0},{"$f":"PERCENTAGE!X73/eSUBMAR!$E$7*10","v":0},{"$f":"PERCENTAGE!Y73/eSUBMAR!$E$8*10","v":0},{"$f":"PERCENTAGE!Z73/eSUBMAR!$E$9*10","v":0},{"$f":"PERCENTAGE!AA73/eSUBMAR!$E$10*10","v":0},{"$f":"PERCENTAGE!AB73/eSUBMAR!$E$11*10","v":0}]
[{"$f":"eSPAR!A73","v":0},{"$f":"eSPAR!B73","v":0},{"$f":"PERCENTAGE!C74/eSUBMAR!$C$6*10","v":0},{"$f":"PERCENTAGE!D74/eSUBMAR!$C$7*10","v":0},{"$f":"PERCENTAGE!E74/eSUBMAR!$C$8*10","v":0},{"$f":"PERCENTAGE!F74/eSUBMAR!$C$9*10","v":0},{"$f":"PERCENTAGE!G74/eSUBMAR!$C$10*10","v":0},{"$f":"PERCENTAGE!H74/eSUBMAR!$C$11*10","v":0},null,null,null,null,{"$f":"PERCENTAGE!M74/eSUBMAR!$D$6*10","v":0},{"$f":"PERCENTAGE!N74/eSUBMAR!$D$7*10","v":0},{"$f":"PERCENTAGE!O74/eSUBMAR!$D$8*10","v":0},{"$f":"PERCENTAGE!P74/eSUBMAR!$D$9*10","v":0},{"$f":"PERCENTAGE!Q74/eSUBMAR!$D$10*10","v":0},{"$f":"PERCENTAGE!R74/eSUBMAR!$D$11*10","v":0},null,null,null,null,{"$f":"PERCENTAGE!W74/eSUBMAR!$E$6*10","v":0},{"$f":"PERCENTAGE!X74/eSUBMAR!$E$7*10","v":0},{"$f":"PERCENTAGE!Y74/eSUBMAR!$E$8*10","v":0},{"$f":"PERCENTAGE!Z74/eSUBMAR!$E$9*10","v":0},{"$f":"PERCENTAGE!AA74/eSUBMAR!$E$10*10","v":0},{"$f":"PERCENTAGE!AB74/eSUBMAR!$E$11*10","v":0}]
[{"$f":"eSPAR!A74","v":0},{"$f":"eSPAR!B74","v":0},{"$f":"PERCENTAGE!C75/eSUBMAR!$C$6*10","v":0},{"$f":"PERCENTAGE!D75/eSUBMAR!$C$7*10","v":0},{"$f":"PERCENTAGE!E75/eSUBMAR!$C$8*10","v":0},{"$f":"PERCENTAGE!F75/eSUBMAR!$C$9*10","v":0},{"$f":"PERCENTAGE!G75/eSUBMAR!$C$10*10","v":0},{"$f":"PERCENTAGE!H75/eSUBMAR!$C$11*10","v":0},null,null,null,null,{"$f":"PERCENTAGE!M75/eSUBMAR!$D$6*10","v":0},{"$f":"PERCENTAGE!N75/eSUBMAR!$D$7*10","v":0},{"$f":"PERCENTAGE!O75/eSUBMAR!$D$8*10","v":0},{"$f":"PERCENTAGE!P75/eSUBMAR!$D$9*10","v":0},{"$f":"PERCENTAGE!Q75/eSUBMAR!$D$10*10","v":0},{"$f":"PERCENTAGE!R75/eSUBMAR!$D$11*10","v":0},null,null,null,null,{"$f":"PERCENTAGE!W75/eSUBMAR!$E$6*10","v":0},{"$f":"PERCENTAGE!X75/eSUBMAR!$E$7*10","v":0},{"$f":"PERCENTAGE!Y75/eSUBMAR!$E$8*10","v":0},{"$f":"PERCENTAGE!Z75/eSUBMAR!$E$9*10","v":0},{"$f":"PERCENTAGE!AA75/eSUBMAR!$E$10*10","v":0},{"$f":"PERCENTAGE!AB75/eSUBMAR!$E$11*10","v":0}]
[{"$f":"eSPAR!A75","v":0},{"$f":"eSPAR!B75","v":0},{"$f":"PERCENTAGE!C76/eSUBMAR!$C$6*10","v":0},{"$f":"PERCENTAGE!D76/eSUBMAR!$C$7*10","v":0},{"$f":"PERCENTAGE!E76/eSUBMAR!$C$8*10","v":0},{"$f":"PERCENTAGE!F76/eSUBMAR!$C$9*10","v":0},{"$f":"PERCENTAGE!G76/eSUBMAR!$C$10*10","v":0},{"$f":"PERCENTAGE!H76/eSUBMAR!$C$11*10","v":0},null,null,null,null,{"$f":"PERCENTAGE!M76/eSUBMAR!$D$6*10","v":0},{"$f":"PERCENTAGE!N76/eSUBMAR!$D$7*10","v":0},{"$f":"PERCENTAGE!O76/eSUBMAR!$D$8*10","v":0},{"$f":"PERCENTAGE!P76/eSUBMAR!$D$9*10","v":0},{"$f":"PERCENTAGE!Q76/eSUBMAR!$D$10*10","v":0},{"$f":"PERCENTAGE!R76/eSUBMAR!$D$11*10","v":0},null,null,null,null,{"$f":"PERCENTAGE!W76/eSUBMAR!$E$6*10","v":0},{"$f":"PERCENTAGE!X76/eSUBMAR!$E$7*10","v":0},{"$f":"PERCENTAGE!Y76/eSUBMAR!$E$8*10","v":0},{"$f":"PERCENTAGE!Z76/eSUBMAR!$E$9*10","v":0},{"$f":"PERCENTAGE!AA76/eSUBMAR!$E$10*10","v":0},{"$f":"PERCENTAGE!AB76/eSUBMAR!$E$11*10","v":0}]
[{"$f":"eSPAR!A76","v":0},{"$f":"eSPAR!B76","v":0},{"$f":"PERCENTAGE!C77/eSUBMAR!$C$6*10","v":0},{"$f":"PERCENTAGE!D77/eSUBMAR!$C$7*10","v":0},{"$f":"PERCENTAGE!E77/eSUBMAR!$C$8*10","v":0},{"$f":"PERCENTAGE!F77/eSUBMAR!$C$9*10","v":0},{"$f":"PERCENTAGE!G77/eSUBMAR!$C$10*10","v":0},{"$f":"PERCENTAGE!H77/eSUBMAR!$C$11*10","v":0},null,null,null,null,{"$f":"PERCENTAGE!M77/eSUBMAR!$D$6*10","v":0},{"$f":"PERCENTAGE!N77/eSUBMAR!$D$7*10","v":0},{"$f":"PERCENTAGE!O77/eSUBMAR!$D$8*10","v":0},{"$f":"PERCENTAGE!P77/eSUBMAR!$D$9*10","v":0},{"$f":"PERCENTAGE!Q77/eSUBMAR!$D$10*10","v":0},{"$f":"PERCENTAGE!R77/eSUBMAR!$D$11*10","v":0},null,null,null,null,{"$f":"PERCENTAGE!W77/eSUBMAR!$E$6*10","v":0},{"$f":"PERCENTAGE!X77/eSUBMAR!$E$7*10","v":0},{"$f":"PERCENTAGE!Y77/eSUBMAR!$E$8*10","v":0},{"$f":"PERCENTAGE!Z77/eSUBMAR!$E$9*10","v":0},{"$f":"PERCENTAGE!AA77/eSUBMAR!$E$10*10","v":0},{"$f":"PERCENTAGE!AB77/eSUBMAR!$E$11*10","v":0}]
[{"$f":"eSPAR!A77","v":0},{"$f":"eSPAR!B77","v":0},{"$f":"PERCENTAGE!C78/eSUBMAR!$C$6*10","v":0},{"$f":"PERCENTAGE!D78/eSUBMAR!$C$7*10","v":0},{"$f":"PERCENTAGE!E78/eSUBMAR!$C$8*10","v":0},{"$f":"PERCENTAGE!F78/eSUBMAR!$C$9*10","v":0},{"$f":"PERCENTAGE!G78/eSUBMAR!$C$10*10","v":0},{"$f":"PERCENTAGE!H78/eSUBMAR!$C$11*10","v":0},null,null,null,null,{"$f":"PERCENTAGE!M78/eSUBMAR!$D$6*10","v":0},{"$f":"PERCENTAGE!N78/eSUBMAR!$D$7*10","v":0},{"$f":"PERCENTAGE!O78/eSUBMAR!$D$8*10","v":0},{"$f":"PERCENTAGE!P78/eSUBMAR!$D$9*10","v":0},{"$f":"PERCENTAGE!Q78/eSUBMAR!$D$10*10","v":0},{"$f":"PERCENTAGE!R78/eSUBMAR!$D$11*10","v":0},null,null,null,null,{"$f":"PERCENTAGE!W78/eSUBMAR!$E$6*10","v":0},{"$f":"PERCENTAGE!X78/eSUBMAR!$E$7*10","v":0},{"$f":"PERCENTAGE!Y78/eSUBMAR!$E$8*10","v":0},{"$f":"PERCENTAGE!Z78/eSUBMAR!$E$9*10","v":0},{"$f":"PERCENTAGE!AA78/eSUBMAR!$E$10*10","v":0},{"$f":"PERCENTAGE!AB78/eSUBMAR!$E$11*10","v":0}]
[{"$f":"eSPAR!A78","v":0},{"$f":"eSPAR!B78","v":0},{"$f":"PERCENTAGE!C79/eSUBMAR!$C$6*10","v":0},{"$f":"PERCENTAGE!D79/eSUBMAR!$C$7*10","v":0},{"$f":"PERCENTAGE!E79/eSUBMAR!$C$8*10","v":0},{"$f":"PERCENTAGE!F79/eSUBMAR!$C$9*10","v":0},{"$f":"PERCENTAGE!G79/eSUBMAR!$C$10*10","v":0},{"$f":"PERCENTAGE!H79/eSUBMAR!$C$11*10","v":0},null,null,null,null,{"$f":"PERCENTAGE!M79/eSUBMAR!$D$6*10","v":0},{"$f":"PERCENTAGE!N79/eSUBMAR!$D$7*10","v":0},{"$f":"PERCENTAGE!O79/eSUBMAR!$D$8*10","v":0},{"$f":"PERCENTAGE!P79/eSUBMAR!$D$9*10","v":0},{"$f":"PERCENTAGE!Q79/eSUBMAR!$D$10*10","v":0},{"$f":"PERCENTAGE!R79/eSUBMAR!$D$11*10","v":0},null,null,null,null,{"$f":"PERCENTAGE!W79/eSUBMAR!$E$6*10","v":0},{"$f":"PERCENTAGE!X79/eSUBMAR!$E$7*10","v":0},{"$f":"PERCENTAGE!Y79/eSUBMAR!$E$8*10","v":0},{"$f":"PERCENTAGE!Z79/eSUBMAR!$E$9*10","v":0},{"$f":"PERCENTAGE!AA79/eSUBMAR!$E$10*10","v":0},{"$f":"PERCENTAGE!AB79/eSUBMAR!$E$11*10","v":0}]
[{"$f":"eSPAR!A79","v":0},{"$f":"eSPAR!B79","v":0},{"$f":"PERCENTAGE!C80/eSUBMAR!$C$6*10","v":0},{"$f":"PERCENTAGE!D80/eSUBMAR!$C$7*10","v":0},{"$f":"PERCENTAGE!E80/eSUBMAR!$C$8*10","v":0},{"$f":"PERCENTAGE!F80/eSUBMAR!$C$9*10","v":0},{"$f":"PERCENTAGE!G80/eSUBMAR!$C$10*10","v":0},{"$f":"PERCENTAGE!H80/eSUBMAR!$C$11*10","v":0},null,null,null,null,{"$f":"PERCENTAGE!M80/eSUBMAR!$D$6*10","v":0},{"$f":"PERCENTAGE!N80/eSUBMAR!$D$7*10","v":0},{"$f":"PERCENTAGE!O80/eSUBMAR!$D$8*10","v":0},{"$f":"PERCENTAGE!P80/eSUBMAR!$D$9*10","v":0},{"$f":"PERCENTAGE!Q80/eSUBMAR!$D$10*10","v":0},{"$f":"PERCENTAGE!R80/eSUBMAR!$D$11*10","v":0},null,null,null,null,{"$f":"PERCENTAGE!W80/eSUBMAR!$E$6*10","v":0},{"$f":"PERCENTAGE!X80/eSUBMAR!$E$7*10","v":0},{"$f":"PERCENTAGE!Y80/eSUBMAR!$E$8*10","v":0},{"$f":"PERCENTAGE!Z80/eSUBMAR!$E$9*10","v":0},{"$f":"PERCENTAGE!AA80/eSUBMAR!$E$10*10","v":0},{"$f":"PERCENTAGE!AB80/eSUBMAR!$E$11*10","v":0}]
[{"$f":"eSPAR!A80","v":0},{"$f":"eSPAR!B80","v":0},{"$f":"PERCENTAGE!C81/eSUBMAR!$C$6*10","v":0},{"$f":"PERCENTAGE!D81/eSUBMAR!$C$7*10","v":0},{"$f":"PERCENTAGE!E81/eSUBMAR!$C$8*10","v":0},{"$f":"PERCENTAGE!F81/eSUBMAR!$C$9*10","v":0},{"$f":"PERCENTAGE!G81/eSUBMAR!$C$10*10","v":0},{"$f":"PERCENTAGE!H81/eSUBMAR!$C$11*10","v":0},null,null,null,null,{"$f":"PERCENTAGE!M81/eSUBMAR!$D$6*10","v":0},{"$f":"PERCENTAGE!N81/eSUBMAR!$D$7*10","v":0},{"$f":"PERCENTAGE!O81/eSUBMAR!$D$8*10","v":0},{"$f":"PERCENTAGE!P81/eSUBMAR!$D$9*10","v":0},{"$f":"PERCENTAGE!Q81/eSUBMAR!$D$10*10","v":0},{"$f":"PERCENTAGE!R81/eSUBMAR!$D$11*10","v":0},null,null,null,null,{"$f":"PERCENTAGE!W81/eSUBMAR!$E$6*10","v":0},{"$f":"PERCENTAGE!X81/eSUBMAR!$E$7*10","v":0},{"$f":"PERCENTAGE!Y81/eSUBMAR!$E$8*10","v":0},{"$f":"PERCENTAGE!Z81/eSUBMAR!$E$9*10","v":0},{"$f":"PERCENTAGE!AA81/eSUBMAR!$E$10*10","v":0},{"$f":"PERCENTAGE!AB81/eSUBMAR!$E$11*10","v":0}]
[{"$f":"eSPAR!A81","v":0},{"$f":"eSPAR!B81","v":0},{"$f":"PERCENTAGE!C82/eSUBMAR!$C$6*10","v":0},{"$f":"PERCENTAGE!D82/eSUBMAR!$C$7*10","v":0},{"$f":"PERCENTAGE!E82/eSUBMAR!$C$8*10","v":0},{"$f":"PERCENTAGE!F82/eSUBMAR!$C$9*10","v":0},{"$f":"PERCENTAGE!G82/eSUBMAR!$C$10*10","v":0},{"$f":"PERCENTAGE!H82/eSUBMAR!$C$11*10","v":0},null,null,null,null,{"$f":"PERCENTAGE!M82/eSUBMAR!$D$6*10","v":0},{"$f":"PERCENTAGE!N82/eSUBMAR!$D$7*10","v":0},{"$f":"PERCENTAGE!O82/eSUBMAR!$D$8*10","v":0},{"$f":"PERCENTAGE!P82/eSUBMAR!$D$9*10","v":0},{"$f":"PERCENTAGE!Q82/eSUBMAR!$D$10*10","v":0},{"$f":"PERCENTAGE!R82/eSUBMAR!$D$11*10","v":0},null,null,null,null,{"$f":"PERCENTAGE!W82/eSUBMAR!$E$6*10","v":0},{"$f":"PERCENTAGE!X82/eSUBMAR!$E$7*10","v":0},{"$f":"PERCENTAGE!Y82/eSUBMAR!$E$8*10","v":0},{"$f":"PERCENTAGE!Z82/eSUBMAR!$E$9*10","v":0},{"$f":"PERCENTAGE!AA82/eSUBMAR!$E$10*10","v":0},{"$f":"PERCENTAGE!AB82/eSUBMAR!$E$11*10","v":0}]
[{"$f":"eSPAR!A82","v":0},{"$f":"eSPAR!B82","v":0},{"$f":"PERCENTAGE!C83/eSUBMAR!$C$6*10","v":0},{"$f":"PERCENTAGE!D83/eSUBMAR!$C$7*10","v":0},{"$f":"PERCENTAGE!E83/eSUBMAR!$C$8*10","v":0},{"$f":"PERCENTAGE!F83/eSUBMAR!$C$9*10","v":0},{"$f":"PERCENTAGE!G83/eSUBMAR!$C$10*10","v":0},{"$f":"PERCENTAGE!H83/eSUBMAR!$C$11*10","v":0},null,null,null,null,{"$f":"PERCENTAGE!M83/eSUBMAR!$D$6*10","v":0},{"$f":"PERCENTAGE!N83/eSUBMAR!$D$7*10","v":0},{"$f":"PERCENTAGE!O83/eSUBMAR!$D$8*10","v":0},{"$f":"PERCENTAGE!P83/eSUBMAR!$D$9*10","v":0},{"$f":"PERCENTAGE!Q83/eSUBMAR!$D$10*10","v":0},{"$f":"PERCENTAGE!R83/eSUBMAR!$D$11*10","v":0},null,null,null,null,{"$f":"PERCENTAGE!W83/eSUBMAR!$E$6*10","v":0},{"$f":"PERCENTAGE!X83/eSUBMAR!$E$7*10","v":0},{"$f":"PERCENTAGE!Y83/eSUBMAR!$E$8*10","v":0},{"$f":"PERCENTAGE!Z83/eSUBMAR!$E$9*10","v":0},{"$f":"PERCENTAGE!AA83/eSUBMAR!$E$10*10","v":0},{"$f":"PERCENTAGE!AB83/eSUBMAR!$E$11*10","v":0}]
[{"$f":"eSPAR!A83","v":0},{"$f":"eSPAR!B83","v":0},{"$f":"PERCENTAGE!C84/eSUBMAR!$C$6*10","v":0},{"$f":"PERCENTAGE!D84/eSUBMAR!$C$7*10","v":0},{"$f":"PERCENTAGE!E84/eSUBMAR!$C$8*10","v":0},{"$f":"PERCENTAGE!F84/eSUBMAR!$C$9*10","v":0},{"$f":"PERCENTAGE!G84/eSUBMAR!$C$10*10","v":0},{"$f":"PERCENTAGE!H84/eSUBMAR!$C$11*10","v":0},null,null,null,null,{"$f":"PERCENTAGE!M84/eSUBMAR!$D$6*10","v":0},{"$f":"PERCENTAGE!N84/eSUBMAR!$D$7*10","v":0},{"$f":"PERCENTAGE!O84/eSUBMAR!$D$8*10","v":0},{"$f":"PERCENTAGE!P84/eSUBMAR!$D$9*10","v":0},{"$f":"PERCENTAGE!Q84/eSUBMAR!$D$10*10","v":0},{"$f":"PERCENTAGE!R84/eSUBMAR!$D$11*10","v":0},null,null,null,null,{"$f":"PERCENTAGE!W84/eSUBMAR!$E$6*10","v":0},{"$f":"PERCENTAGE!X84/eSUBMAR!$E$7*10","v":0},{"$f":"PERCENTAGE!Y84/eSUBMAR!$E$8*10","v":0},{"$f":"PERCENTAGE!Z84/eSUBMAR!$E$9*10","v":0},{"$f":"PERCENTAGE!AA84/eSUBMAR!$E$10*10","v":0},{"$f":"PERCENTAGE!AB84/eSUBMAR!$E$11*10","v":0}]
[{"$f":"eSPAR!A84","v":0},{"$f":"eSPAR!B84","v":0},{"$f":"PERCENTAGE!C85/eSUBMAR!$C$6*10","v":0},{"$f":"PERCENTAGE!D85/eSUBMAR!$C$7*10","v":0},{"$f":"PERCENTAGE!E85/eSUBMAR!$C$8*10","v":0},{"$f":"PERCENTAGE!F85/eSUBMAR!$C$9*10","v":0},{"$f":"PERCENTAGE!G85/eSUBMAR!$C$10*10","v":0},{"$f":"PERCENTAGE!H85/eSUBMAR!$C$11*10","v":0},null,null,null,null,{"$f":"PERCENTAGE!M85/eSUBMAR!$D$6*10","v":0},{"$f":"PERCENTAGE!N85/eSUBMAR!$D$7*10","v":0},{"$f":"PERCENTAGE!O85/eSUBMAR!$D$8*10","v":0},{"$f":"PERCENTAGE!P85/eSUBMAR!$D$9*10","v":0},{"$f":"PERCENTAGE!Q85/eSUBMAR!$D$10*10","v":0},{"$f":"PERCENTAGE!R85/eSUBMAR!$D$11*10","v":0},null,null,null,null,{"$f":"PERCENTAGE!W85/eSUBMAR!$E$6*10","v":0},{"$f":"PERCENTAGE!X85/eSUBMAR!$E$7*10","v":0},{"$f":"PERCENTAGE!Y85/eSUBMAR!$E$8*10","v":0},{"$f":"PERCENTAGE!Z85/eSUBMAR!$E$9*10","v":0},{"$f":"PERCENTAGE!AA85/eSUBMAR!$E$10*10","v":0},{"$f":"PERCENTAGE!AB85/eSUBMAR!$E$11*10","v":0}]
[{"$f":"eSPAR!A85","v":0},{"$f":"eSPAR!B85","v":0},{"$f":"PERCENTAGE!C86/eSUBMAR!$C$6*10","v":0},{"$f":"PERCENTAGE!D86/eSUBMAR!$C$7*10","v":0},{"$f":"PERCENTAGE!E86/eSUBMAR!$C$8*10","v":0},{"$f":"PERCENTAGE!F86/eSUBMAR!$C$9*10","v":0},{"$f":"PERCENTAGE!G86/eSUBMAR!$C$10*10","v":0},{"$f":"PERCENTAGE!H86/eSUBMAR!$C$11*10","v":0},null,null,null,null,{"$f":"PERCENTAGE!M86/eSUBMAR!$D$6*10","v":0},{"$f":"PERCENTAGE!N86/eSUBMAR!$D$7*10","v":0},{"$f":"PERCENTAGE!O86/eSUBMAR!$D$8*10","v":0},{"$f":"PERCENTAGE!P86/eSUBMAR!$D$9*10","v":0},{"$f":"PERCENTAGE!Q86/eSUBMAR!$D$10*10","v":0},{"$f":"PERCENTAGE!R86/eSUBMAR!$D$11*10","v":0},null,null,null,null,{"$f":"PERCENTAGE!W86/eSUBMAR!$E$6*10","v":0},{"$f":"PERCENTAGE!X86/eSUBMAR!$E$7*10","v":0},{"$f":"PERCENTAGE!Y86/eSUBMAR!$E$8*10","v":0},{"$f":"PERCENTAGE!Z86/eSUBMAR!$E$9*10","v":0},{"$f":"PERCENTAGE!AA86/eSUBMAR!$E$10*10","v":0},{"$f":"PERCENTAGE!AB86/eSUBMAR!$E$11*10","v":0}]

{"sheet":"eSUBWAR","index":3,"n_rows":21,"n_cols":9,"rows_kept":21,"cut":false,"hidden":true,"merged":[[13,1,13,6],[6,1,6,2]]}
[null,null,null,null,null,"MM"]
[null,null,null,null,null,{"$f":"IF(eSUBMAR!A6=\"\",0,100)","v":100}]
[null,null,null,null,null,{"$f":"IF(eSUBMAR!A7=\"\",0,100)","v":100}]
[null,null,null,null,null,{"$f":"IF(eSUBMAR!A8=\"\",0,100)","v":100}]
[null,null,null,null,null,{"$f":"IF(eSUBMAR!A9=\"\",0,100)","v":100}]
[null,null,null,null,null,{"$f":"IF(eSUBMAR!A10=\"\",0,100)","v":100}]
[null,null,null,null,null,{"$f":"IF(eSUBMAR!A11=\"\",0,100)","v":100}]
[]
[]
[]
[]
[null,null,null,null,null,{"$f":"SUM(F2:F11)","v":600}]
[]
[]
[]
[]
[null,null,null,null,null,null,null,null,{"$f":"IF(B16=Main!C18,\"OK\",\"Invalid\")","v":"OK"}]
[null,null,null,null,null,null,null,null,"ok"]
[null,null,null,null,null,null,null,null,"ok"]
[null,null,null,null,null,null,null,null,"OK"]
[null,null,null,null,null,null,null,null,{"$f":"IF(AND(I17=\"OK\",I18=\"OK\",I19=\"OK\",I20=\"OK\"),\"Valid\", \"Expired\")","v":"Valid"}]

{"sheet":"Main","index":4,"n_rows":17,"n_cols":8,"rows_kept":17,"cut":false,"hidden":false,"merged":[[10,2,10,3],[16,2,16,7],[17,2,17,7],[14,2,14,3],[13,7,14,7],[9,2,9,3],[8,2,8,3],[7,2,7,3],[6,2,6,3],[0,2,0,7],[1,2,1,7],[4,2,4,3],[5,2,5,3],[2,4,2,6],[2,2,2,3]]}
[null,null,{"$f":"Internal!C25","v":"Golden Valley School"}]
[null,null,{"$f":"Internal!C27","v":"Hanuman Gali, Pushkar, Rajasthan"}]
[null,null,null,null,{"$f":"Internal!B34","v":"Class : IX"},null,null,"License Status- Trial Version"]
[]
[null,null,"Data Entry",null,null,"Print Class Wise Reports",null,"Subjects and Max. Marks"]
[null,null,"Students Particulars",null,null,"Students List",null,"Subjects & Max. Marks"]
[null,null,"Enter Marks",null,null,"Periodic Test 1"]
[null,null,"Enter Attendance",null,null,"Periodic Test 2",null,"Report Card Issue Date"]
[null,null,"Co-Scholastic Grades",null,null,"Periodic Test 3",null,"18/12/2017"]
[null,null,"Discipline",null,null,"Average of Best 2 PTs"]
[null,null,"Print Report Card",null,null,"Notebook Submission (NS)",null,"Promoted to Class"]
[null,null,"PT 1","PT 2",null,"Subject Enrichment (SEA)",null,"Xth"]
[null,null,"PT 3","Best 2 PT",null,"PT + NS + SE"]
[null,null,"Notebook","SEA",null,"Annual Exam",null,"Update School\nInformation"]
[null,null,"FINAL REPORT CARD",null,null,"Final Mark List"]
[]
[null,null,"Powered by Paras Hosting | Visit us at : www.ParasHosting.com | Email: response@parashosting.com"]

{"sheet":"eSUBMAR","index":5,"n_rows":11,"n_cols":8,"rows_kept":11,"cut":false,"hidden":false,"merged":[[0,0,0,7],[1,0,1,7]]}
["Customise Subject & Max. Marks"]
[{"$f":"Internal!B34","v":"Class : IX"}]
[]
[]
["Sr.","Subject","PT 1","PT 2","PT 3","NS","SEA","Annual Exam"]
[1,"English",10,10,10,5,5,80]
[2,"Hindi",10,10,10,5,5,80]
[3,"Mathematics",10,10,10,5,5,80]
[4,"Science",10,10,10,5,5,80]
[5,"Social Studies",10,10,10,5,5,80]
[6,"I.T.",10,10,10,5,5,80]

{"sheet":"eSPAR","index":6,"n_rows":7,"n_cols":7,"rows_kept":7,"cut":false,"hidden":false,"merged":[[1,0,1,6],[2,0,2,6]]}
[]
["ENTER Students Particulars"]
[{"$f":"Internal!B34","v":"Class : IX"}]
[]
["Roll No.","Name","Mother Name","Father Name","Date of Birth","Address","Admission No."]
[1,"Aman Kumar","Sheetal Rani","Naimesh Mehta","11/11/2001","#44, Model Town, Hisar","25445"]
[2]

{"sheet":"eMARKS","index":7,"n_rows":86,"n_cols":38,"rows_kept":86,"cut":false,"hidden":false,"merged":[[3,26,3,31],[3,32,3,37],[3,20,3,25],[1,0,1,7],[0,0,0,7],[3,8,3,13],[3,2,3,7],[3,14,3,19],[3,0,5,0],[3,1,4,1]]}
["Enter Marks"]
[{"$f":"Internal!B34","v":"Class : IX"}]
[]
["Roll No.","Name","Periodic Test 1 (PT1)",null,null,null,null,null,"Periodic Test 2 (PT2)",null,null,null,null,null,"Periodic Test 3 (PT 3)",null,null,null,null,null,"Notebook Submission",null,null,null,null,null,"Sub Enrichment Activity (SEA)",null,null,null,null,null,"Annual Exam"]
[null,null,{"$f":"eSUBMAR!B6","v":"English"},{"$f":"eSUBMAR!B7","v":"Hindi"},{"$f":"eSUBMAR!B8","v":"Mathematics"},{"$f":"eSUBMAR!B9","v":"Science"},{"$f":"eSUBMAR!B10","v":"Social Studies"},{"$f":"eSUBMAR!B11","v":"I.T."},{"$f":"eSUBMAR!B6","v":"English"},{"$f":"eSUBMAR!B7","v":"Hindi"},{"$f":"eSUBMAR!B8","v":"Mathematics"},{"$f":"eSUBMAR!B9","v":"Science"},{"$f":"eSUBMAR!B10","v":"Social Studies"},{"$f":"eSUBMAR!B11","v":"I.T."},{"$f":"eSUBMAR!B6","v":"English"},{"$f":"eSUBMAR!B7","v":"Hindi"},{"$f":"eSUBMAR!B8","v":"Mathematics"},{"$f":"eSUBMAR!B9","v":"Science"},{"$f":"eSUBMAR!B10","v":"Social Studies"},{"$f":"eSUBMAR!B11","v":"I.T."},{"$f":"eSUBMAR!B6","v":"English"},{"$f":"eSUBMAR!B7","v":"Hindi"},{"$f":"eSUBMAR!B8","v":"Mathematics"},{"$f":"eSUBMAR!B9","v":"Science"},{"$f":"eSUBMAR!B10","v":"Social Studies"},{"$f":"eSUBMAR!B11","v":"I.T."},{"$f":"eSUBMAR!B6","v":"English"},{"$f":"eSUBMAR!B7","v":"Hindi"},{"$f":"eSUBMAR!B8","v":"Mathematics"},{"$f":"eSUBMAR!B9","v":"Science"},{"$f":"eSUBMAR!B10","v":"Social Studies"},{"$f":"eSUBMAR!B11","v":"I.T."},{"$f":"eSUBMAR!B6","v":"English"},{"$f":"eSUBMAR!B7","v":"Hindi"},{"$f":"eSUBMAR!B8","v":"Mathematics"},{"$f":"eSUBMAR!B9","v":"Science"},{"$f":"eSUBMAR!B10","v":"Social Studies"},{"$f":"eSUBMAR!B11","v":"I.T."}]
[null,"Maximum Marks >>",{"$f":"eSUBMAR!C6","v":10},{"$f":"eSUBMAR!C7","v":10},{"$f":"eSUBMAR!C8","v":10},{"$f":"eSUBMAR!C9","v":10},{"$f":"eSUBMAR!C10","v":10},{"$f":"eSUBMAR!C11","v":10},{"$f":"eSUBMAR!D6","v":10},{"$f":"eSUBMAR!D7","v":10},{"$f":"eSUBMAR!D8","v":10},{"$f":"eSUBMAR!D9","v":10},{"$f":"eSUBMAR!D10","v":10},{"$f":"eSUBMAR!D11","v":10},{"$f":"eSUBMAR!E6","v":10},{"$f":"eSUBMAR!E7","v":10},{"$f":"eSUBMAR!E8","v":10},{"$f":"eSUBMAR!E9","v":10},{"$f":"eSUBMAR!E10","v":10},{"$f":"eSUBMAR!E11","v":10},{"$f":"eSUBMAR!F6","v":5},{"$f":"eSUBMAR!F7","v":5},{"$f":"eSUBMAR!F8","v":5},{"$f":"eSUBMAR!F9","v":5},{"$f":"eSUBMAR!F10","v":5},{"$f":"eSUBMAR!F11","v":5},{"$f":"eSUBMAR!G6","v":5},{"$f":"eSUBMAR!G7","v":5},{"$f":"eSUBMAR!G8","v":5},{"$f":"eSUBMAR!G9","v":5},{"$f":"eSUBMAR!G10","v":5},{"$f":"eSUBMAR!G11","v":5},{"$f":"eSUBMAR!H6","v":80},{"$f":"eSUBMAR!H7","v":80},{"$f":"eSUBMAR!H8","v":80},{"$f":"eSUBMAR!H9","v":80},{"$f":"eSUBMAR!H10","v":80},{"$f":"eSUBMAR!H11","v":80}]
[1,{"$f":"eSPAR!B6","v":"Aman Kumar"},7,6,7,8,8,5,6,7,5,6,5,6,7,8,9,6,7,8]
[{"$f":"eSPAR!A7","v":2},{"$f":"eSPAR!B7","v":0}]
[{"$f":"eSPAR!A8","v":0},{"$f":"eSPAR!B8","v":0}]
[{"$f":"eSPAR!A9","v":0},{"$f":"eSPAR!B9","v":0}]
[{"$f":"eSPAR!A10","v":0},{"$f":"eSPAR!B10","v":0}]
[{"$f":"eSPAR!A11","v":0},{"$f":"eSPAR!B11","v":0}]
[{"$f":"eSPAR!A12","v":0},{"$f":"eSPAR!B12","v":0}]
[{"$f":"eSPAR!A13","v":0},{"$f":"eSPAR!B13","v":0}]
[{"$f":"eSPAR!A14","v":0},{"$f":"eSPAR!B14","v":0}]
[{"$f":"eSPAR!A15","v":0},{"$f":"eSPAR!B15","v":0}]
[{"$f":"eSPAR!A16","v":0},{"$f":"eSPAR!B16","v":0}]
[{"$f":"eSPAR!A17","v":0},{"$f":"eSPAR!B17","v":0}]
[{"$f":"eSPAR!A18","v":0},{"$f":"eSPAR!B18","v":0}]
[{"$f":"eSPAR!A19","v":0},{"$f":"eSPAR!B19","v":0}]
[{"$f":"eSPAR!A20","v":0},{"$f":"eSPAR!B20","v":0}]
[{"$f":"eSPAR!A21","v":0},{"$f":"eSPAR!B21","v":0}]
[{"$f":"eSPAR!A22","v":0},{"$f":"eSPAR!B22","v":0}]
[{"$f":"eSPAR!A23","v":0},{"$f":"eSPAR!B23","v":0}]
[{"$f":"eSPAR!A24","v":0},{"$f":"eSPAR!B24","v":0}]
[{"$f":"eSPAR!A25","v":0},{"$f":"eSPAR!B25","v":0}]
[{"$f":"eSPAR!A26","v":0},{"$f":"eSPAR!B26","v":0}]
[{"$f":"eSPAR!A27","v":0},{"$f":"eSPAR!B27","v":0}]
[{"$f":"eSPAR!A28","v":0},{"$f":"eSPAR!B28","v":0}]
[{"$f":"eSPAR!A29","v":0},{"$f":"eSPAR!B29","v":0}]
[{"$f":"eSPAR!A30","v":0},{"$f":"eSPAR!B30","v":0}]
[{"$f":"eSPAR!A31","v":0},{"$f":"eSPAR!B31","v":0}]
[{"$f":"eSPAR!A32","v":0},{"$f":"eSPAR!B32","v":0}]
[{"$f":"eSPAR!A33","v":0},{"$f":"eSPAR!B33","v":0}]
[{"$f":"eSPAR!A34","v":0},{"$f":"eSPAR!B34","v":0}]
[{"$f":"eSPAR!A35","v":0},{"$f":"eSPAR!B35","v":0}]
[{"$f":"eSPAR!A36","v":0},{"$f":"eSPAR!B36","v":0}]
[{"$f":"eSPAR!A37","v":0},{"$f":"eSPAR!B37","v":0}]
[{"$f":"eSPAR!A38","v":0},{"$f":"eSPAR!B38","v":0}]
[{"$f":"eSPAR!A39","v":0},{"$f":"eSPAR!B39","v":0}]
[{"$f":"eSPAR!A40","v":0},{"$f":"eSPAR!B40","v":0}]
[{"$f":"eSPAR!A41","v":0},{"$f":"eSPAR!B41","v":0}]
[{"$f":"eSPAR!A42","v":0},{"$f":"eSPAR!B42","v":0}]
[{"$f":"eSPAR!A43","v":0},{"$f":"eSPAR!B43","v":0}]
[{"$f":"eSPAR!A44","v":0},{"$f":"eSPAR!B44","v":0}]
[{"$f":"eSPAR!A45","v":0},{"$f":"eSPAR!B45","v":0}]
[{"$f":"eSPAR!A46","v":0},{"$f":"eSPAR!B46","v":0}]
[{"$f":"eSPAR!A47","v":0},{"$f":"eSPAR!B47","v":0}]
[{"$f":"eSPAR!A48","v":0},{"$f":"eSPAR!B48","v":0}]
[{"$f":"eSPAR!A49","v":0},{"$f":"eSPAR!B49","v":0}]
[{"$f":"eSPAR!A50","v":0},{"$f":"eSPAR!B50","v":0}]
[{"$f":"eSPAR!A51","v":0},{"$f":"eSPAR!B51","v":0}]
[{"$f":"eSPAR!A52","v":0},{"$f":"eSPAR!B52","v":0}]
[{"$f":"eSPAR!A53","v":0},{"$f":"eSPAR!B53","v":0}]
[{"$f":"eSPAR!A54","v":0},{"$f":"eSPAR!B54","v":0}]
[{"$f":"eSPAR!A55","v":0},{"$f":"eSPAR!B55","v":0}]
[{"$f":"eSPAR!A56","v":0},{"$f":"eSPAR!B56","v":0}]
[{"$f":"eSPAR!A57","v":0},{"$f":"eSPAR!B57","v":0}]
[{"$f":"eSPAR!A58","v":0},{"$f":"eSPAR!B58","v":0}]
[{"$f":"eSPAR!A59","v":0},{"$f":"eSPAR!B59","v":0}]
[{"$f":"eSPAR!A60","v":0},{"$f":"eSPAR!B60","v":0}]
[{"$f":"eSPAR!A61","v":0},{"$f":"eSPAR!B61","v":0}]
[{"$f":"eSPAR!A62","v":0},{"$f":"eSPAR!B62","v":0}]
[{"$f":"eSPAR!A63","v":0},{"$f":"eSPAR!B63","v":0}]
[{"$f":"eSPAR!A64","v":0},{"$f":"eSPAR!B64","v":0}]
[{"$f":"eSPAR!A65","v":0},{"$f":"eSPAR!B65","v":0}]
[{"$f":"eSPAR!A66","v":0},{"$f":"eSPAR!B66","v":0}]
[{"$f":"eSPAR!A67","v":0},{"$f":"eSPAR!B67","v":0}]
[{"$f":"eSPAR!A68","v":0},{"$f":"eSPAR!B68","v":0}]
[{"$f":"eSPAR!A69","v":0},{"$f":"eSPAR!B69","v":0}]
[{"$f":"eSPAR!A70","v":0},{"$f":"eSPAR!B70","v":0}]
[{"$f":"eSPAR!A71","v":0},{"$f":"eSPAR!B71","v":0}]
[{"$f":"eSPAR!A72","v":0},{"$f":"eSPAR!B72","v":0}]
[{"$f":"eSPAR!A73","v":0},{"$f":"eSPAR!B73","v":0}]
[{"$f":"eSPAR!A74","v":0},{"$f":"eSPAR!B74","v":0}]
[{"$f":"eSPAR!A75","v":0},{"$f":"eSPAR!B75","v":0}]
[{"$f":"eSPAR!A76","v":0},{"$f":"eSPAR!B76","v":0}]
[{"$f":"eSPAR!A77","v":0},{"$f":"eSPAR!B77","v":0}]
[{"$f":"eSPAR!A78","v":0},{"$f":"eSPAR!B78","v":0}]
[{"$f":"eSPAR!A79","v":0},{"$f":"eSPAR!B79","v":0}]
[{"$f":"eSPAR!A80","v":0},{"$f":"eSPAR!B80","v":0}]
[{"$f":"eSPAR!A81","v":0},{"$f":"eSPAR!B81","v":0}]
[{"$f":"eSPAR!A82","v":0},{"$f":"eSPAR!B82","v":0}]
[{"$f":"eSPAR!A83","v":0},{"$f":"eSPAR!B83","v":0}]
[{"$f":"eSPAR!A84","v":0},{"$f":"eSPAR!B84","v":0}]
[{"$f":"eSPAR!A85","v":0},{"$f":"eSPAR!B85","v":0}]

{"sheet":"pSPAR","index":8,"n_rows":85,"n_cols":7,"rows_kept":85,"cut":false,"hidden":false,"merged":[[2,0,2,6],[1,0,1,6],[0,0,0,6]]}
[{"$f":"Internal!C25","v":"Golden Valley School"}]
["Students Particulars"]
[{"$f":"Internal!B34","v":"Class : IX"}]
[]
["Roll No.","Name","Mother's Name","Father's Name","Date of Birth","Address","Adm. No."]
[{"$f":"eSPAR!A6","v":1},{"$f":"eSPAR!B6","v":"Aman Kumar"},{"$f":"eSPAR!C6","v":"Sheetal Rani"},{"$f":"eSPAR!D6","v":"Naimesh Mehta"},{"$f":"eSPAR!E6","v":"11/11/2001"},{"$f":"eSPAR!F6","v":"#44, Model Town, Hisar"},{"$f":"eSPAR!G6","v":"25445"}]
[{"$f":"eSPAR!A7","v":2},{"$f":"eSPAR!B7","v":0},{"$f":"eSPAR!C7","v":0},{"$f":"eSPAR!D7","v":0},{"$f":"eSPAR!E7","v":0},{"$f":"eSPAR!F7","v":0},{"$f":"eSPAR!G7","v":0}]
[{"$f":"eSPAR!A8","v":0},{"$f":"eSPAR!B8","v":0},{"$f":"eSPAR!C8","v":0},{"$f":"eSPAR!D8","v":0},{"$f":"eSPAR!E8","v":0},{"$f":"eSPAR!F8","v":0},{"$f":"eSPAR!G8","v":0}]
[{"$f":"eSPAR!A9","v":0},{"$f":"eSPAR!B9","v":0},{"$f":"eSPAR!C9","v":0},{"$f":"eSPAR!D9","v":0},{"$f":"eSPAR!E9","v":0},{"$f":"eSPAR!F9","v":0},{"$f":"eSPAR!G9","v":0}]
[{"$f":"eSPAR!A10","v":0},{"$f":"eSPAR!B10","v":0},{"$f":"eSPAR!C10","v":0},{"$f":"eSPAR!D10","v":0},{"$f":"eSPAR!E10","v":0},{"$f":"eSPAR!F10","v":0},{"$f":"eSPAR!G10","v":0}]
[{"$f":"eSPAR!A11","v":0},{"$f":"eSPAR!B11","v":0},{"$f":"eSPAR!C11","v":0},{"$f":"eSPAR!D11","v":0},{"$f":"eSPAR!E11","v":0},{"$f":"eSPAR!F11","v":0},{"$f":"eSPAR!G11","v":0}]
[{"$f":"eSPAR!A12","v":0},{"$f":"eSPAR!B12","v":0},{"$f":"eSPAR!C12","v":0},{"$f":"eSPAR!D12","v":0},{"$f":"eSPAR!E12","v":0},{"$f":"eSPAR!F12","v":0},{"$f":"eSPAR!G12","v":0}]
[{"$f":"eSPAR!A13","v":0},{"$f":"eSPAR!B13","v":0},{"$f":"eSPAR!C13","v":0},{"$f":"eSPAR!D13","v":0},{"$f":"eSPAR!E13","v":0},{"$f":"eSPAR!F13","v":0},{"$f":"eSPAR!G13","v":0}]
[{"$f":"eSPAR!A14","v":0},{"$f":"eSPAR!B14","v":0},{"$f":"eSPAR!C14","v":0},{"$f":"eSPAR!D14","v":0},{"$f":"eSPAR!E14","v":0},{"$f":"eSPAR!F14","v":0},{"$f":"eSPAR!G14","v":0}]
[{"$f":"eSPAR!A15","v":0},{"$f":"eSPAR!B15","v":0},{"$f":"eSPAR!C15","v":0},{"$f":"eSPAR!D15","v":0},{"$f":"eSPAR!E15","v":0},{"$f":"eSPAR!F15","v":0},{"$f":"eSPAR!G15","v":0}]
[{"$f":"eSPAR!A16","v":0},{"$f":"eSPAR!B16","v":0},{"$f":"eSPAR!C16","v":0},{"$f":"eSPAR!D16","v":0},{"$f":"eSPAR!E16","v":0},{"$f":"eSPAR!F16","v":0},{"$f":"eSPAR!G16","v":0}]
[{"$f":"eSPAR!A17","v":0},{"$f":"eSPAR!B17","v":0},{"$f":"eSPAR!C17","v":0},{"$f":"eSPAR!D17","v":0},{"$f":"eSPAR!E17","v":0},{"$f":"eSPAR!F17","v":0},{"$f":"eSPAR!G17","v":0}]
[{"$f":"eSPAR!A18","v":0},{"$f":"eSPAR!B18","v":0},{"$f":"eSPAR!C18","v":0},{"$f":"eSPAR!D18","v":0},{"$f":"eSPAR!E18","v":0},{"$f":"eSPAR!F18","v":0},{"$f":"eSPAR!G18","v":0}]
[{"$f":"eSPAR!A19","v":0},{"$f":"eSPAR!B19","v":0},{"$f":"eSPAR!C19","v":0},{"$f":"eSPAR!D19","v":0},{"$f":"eSPAR!E19","v":0},{"$f":"eSPAR!F19","v":0},{"$f":"eSPAR!G19","v":0}]
[{"$f":"eSPAR!A20","v":0},{"$f":"eSPAR!B20","v":0},{"$f":"eSPAR!C20","v":0},{"$f":"eSPAR!D20","v":0},{"$f":"eSPAR!E20","v":0},{"$f":"eSPAR!F20","v":0},{"$f":"eSPAR!G20","v":0}]
[{"$f":"eSPAR!A21","v":0},{"$f":"eSPAR!B21","v":0},{"$f":"eSPAR!C21","v":0},{"$f":"eSPAR!D21","v":0},{"$f":"eSPAR!E21","v":0},{"$f":"eSPAR!F21","v":0},{"$f":"eSPAR!G21","v":0}]
[{"$f":"eSPAR!A22","v":0},{"$f":"eSPAR!B22","v":0},{"$f":"eSPAR!C22","v":0},{"$f":"eSPAR!D22","v":0},{"$f":"eSPAR!E22","v":0},{"$f":"eSPAR!F22","v":0},{"$f":"eSPAR!G22","v":0}]
[{"$f":"eSPAR!A23","v":0},{"$f":"eSPAR!B23","v":0},{"$f":"eSPAR!C23","v":0},{"$f":"eSPAR!D23","v":0},{"$f":"eSPAR!E23","v":0},{"$f":"eSPAR!F23","v":0},{"$f":"eSPAR!G23","v":0}]
[{"$f":"eSPAR!A24","v":0},{"$f":"eSPAR!B24","v":0},{"$f":"eSPAR!C24","v":0},{"$f":"eSPAR!D24","v":0},{"$f":"eSPAR!E24","v":0},{"$f":"eSPAR!F24","v":0},{"$f":"eSPAR!G24","v":0}]
[{"$f":"eSPAR!A25","v":0},{"$f":"eSPAR!B25","v":0},{"$f":"eSPAR!C25","v":0},{"$f":"eSPAR!D25","v":0},{"$f":"eSPAR!E25","v":0},{"$f":"eSPAR!F25","v":0},{"$f":"eSPAR!G25","v":0}]
[{"$f":"eSPAR!A26","v":0},{"$f":"eSPAR!B26","v":0},{"$f":"eSPAR!C26","v":0},{"$f":"eSPAR!D26","v":0},{"$f":"eSPAR!E26","v":0},{"$f":"eSPAR!F26","v":0},{"$f":"eSPAR!G26","v":0}]
[{"$f":"eSPAR!A27","v":0},{"$f":"eSPAR!B27","v":0},{"$f":"eSPAR!C27","v":0},{"$f":"eSPAR!D27","v":0},{"$f":"eSPAR!E27","v":0},{"$f":"eSPAR!F27","v":0},{"$f":"eSPAR!G27","v":0}]
[{"$f":"eSPAR!A28","v":0},{"$f":"eSPAR!B28","v":0},{"$f":"eSPAR!C28","v":0},{"$f":"eSPAR!D28","v":0},{"$f":"eSPAR!E28","v":0},{"$f":"eSPAR!F28","v":0},{"$f":"eSPAR!G28","v":0}]
[{"$f":"eSPAR!A29","v":0},{"$f":"eSPAR!B29","v":0},{"$f":"eSPAR!C29","v":0},{"$f":"eSPAR!D29","v":0},{"$f":"eSPAR!E29","v":0},{"$f":"eSPAR!F29","v":0},{"$f":"eSPAR!G29","v":0}]
[{"$f":"eSPAR!A30","v":0},{"$f":"eSPAR!B30","v":0},{"$f":"eSPAR!C30","v":0},{"$f":"eSPAR!D30","v":0},{"$f":"eSPAR!E30","v":0},{"$f":"eSPAR!F30","v":0},{"$f":"eSPAR!G30","v":0}]
[{"$f":"eSPAR!A31","v":0},{"$f":"eSPAR!B31","v":0},{"$f":"eSPAR!C31","v":0},{"$f":"eSPAR!D31","v":0},{"$f":"eSPAR!E31","v":0},{"$f":"eSPAR!F31","v":0},{"$f":"eSPAR!G31","v":0}]
[{"$f":"eSPAR!A32","v":0},{"$f":"eSPAR!B32","v":0},{"$f":"eSPAR!C32","v":0},{"$f":"eSPAR!D32","v":0},{"$f":"eSPAR!E32","v":0},{"$f":"eSPAR!F32","v":0},{"$f":"eSPAR!G32","v":0}]
[{"$f":"eSPAR!A33","v":0},{"$f":"eSPAR!B33","v":0},{"$f":"eSPAR!C33","v":0},{"$f":"eSPAR!D33","v":0},{"$f":"eSPAR!E33","v":0},{"$f":"eSPAR!F33","v":0},{"$f":"eSPAR!G33","v":0}]
[{"$f":"eSPAR!A34","v":0},{"$f":"eSPAR!B34","v":0},{"$f":"eSPAR!C34","v":0},{"$f":"eSPAR!D34","v":0},{"$f":"eSPAR!E34","v":0},{"$f":"eSPAR!F34","v":0},{"$f":"eSPAR!G34","v":0}]
[{"$f":"eSPAR!A35","v":0},{"$f":"eSPAR!B35","v":0},{"$f":"eSPAR!C35","v":0},{"$f":"eSPAR!D35","v":0},{"$f":"eSPAR!E35","v":0},{"$f":"eSPAR!F35","v":0},{"$f":"eSPAR!G35","v":0}]
[{"$f":"eSPAR!A36","v":0},{"$f":"eSPAR!B36","v":0},{"$f":"eSPAR!C36","v":0},{"$f":"eSPAR!D36","v":0},{"$f":"eSPAR!E36","v":0},{"$f":"eSPAR!F36","v":0},{"$f":"eSPAR!G36","v":0}]
[{"$f":"eSPAR!A37","v":0},{"$f":"eSPAR!B37","v":0},{"$f":"eSPAR!C37","v":0},{"$f":"eSPAR!D37","v":0},{"$f":"eSPAR!E37","v":0},{"$f":"eSPAR!F37","v":0},{"$f":"eSPAR!G37","v":0}]
[{"$f":"eSPAR!A38","v":0},{"$f":"eSPAR!B38","v":0},{"$f":"eSPAR!C38","v":0},{"$f":"eSPAR!D38","v":0},{"$f":"eSPAR!E38","v":0},{"$f":"eSPAR!F38","v":0},{"$f":"eSPAR!G38","v":0}]
[{"$f":"eSPAR!A39","v":0},{"$f":"eSPAR!B39","v":0},{"$f":"eSPAR!C39","v":0},{"$f":"eSPAR!D39","v":0},{"$f":"eSPAR!E39","v":0},{"$f":"eSPAR!F39","v":0},{"$f":"eSPAR!G39","v":0}]
[{"$f":"eSPAR!A40","v":0},{"$f":"eSPAR!B40","v":0},{"$f":"eSPAR!C40","v":0},{"$f":"eSPAR!D40","v":0},{"$f":"eSPAR!E40","v":0},{"$f":"eSPAR!F40","v":0},{"$f":"eSPAR!G40","v":0}]
[{"$f":"eSPAR!A41","v":0},{"$f":"eSPAR!B41","v":0},{"$f":"eSPAR!C41","v":0},{"$f":"eSPAR!D41","v":0},{"$f":"eSPAR!E41","v":0},{"$f":"eSPAR!F41","v":0},{"$f":"eSPAR!G41","v":0}]
[{"$f":"eSPAR!A42","v":0},{"$f":"eSPAR!B42","v":0},{"$f":"eSPAR!C42","v":0},{"$f":"eSPAR!D42","v":0},{"$f":"eSPAR!E42","v":0},{"$f":"eSPAR!F42","v":0},{"$f":"eSPAR!G42","v":0}]
[{"$f":"eSPAR!A43","v":0},{"$f":"eSPAR!B43","v":0},{"$f":"eSPAR!C43","v":0},{"$f":"eSPAR!D43","v":0},{"$f":"eSPAR!E43","v":0},{"$f":"eSPAR!F43","v":0},{"$f":"eSPAR!G43","v":0}]
[{"$f":"eSPAR!A44","v":0},{"$f":"eSPAR!B44","v":0},{"$f":"eSPAR!C44","v":0},{"$f":"eSPAR!D44","v":0},{"$f":"eSPAR!E44","v":0},{"$f":"eSPAR!F44","v":0},{"$f":"eSPAR!G44","v":0}]
[{"$f":"eSPAR!A45","v":0},{"$f":"eSPAR!B45","v":0},{"$f":"eSPAR!C45","v":0},{"$f":"eSPAR!D45","v":0},{"$f":"eSPAR!E45","v":0},{"$f":"eSPAR!F45","v":0},{"$f":"eSPAR!G45","v":0}]
[{"$f":"eSPAR!A46","v":0},{"$f":"eSPAR!B46","v":0},{"$f":"eSPAR!C46","v":0},{"$f":"eSPAR!D46","v":0},{"$f":"eSPAR!E46","v":0},{"$f":"eSPAR!F46","v":0},{"$f":"eSPAR!G46","v":0}]
[{"$f":"eSPAR!A47","v":0},{"$f":"eSPAR!B47","v":0},{"$f":"eSPAR!C47","v":0},{"$f":"eSPAR!D47","v":0},{"$f":"eSPAR!E47","v":0},{"$f":"eSPAR!F47","v":0},{"$f":"eSPAR!G47","v":0}]
[{"$f":"eSPAR!A48","v":0},{"$f":"eSPAR!B48","v":0},{"$f":"eSPAR!C48","v":0},{"$f":"eSPAR!D48","v":0},{"$f":"eSPAR!E48","v":0},{"$f":"eSPAR!F48","v":0},{"$f":"eSPAR!G48","v":0}]
[{"$f":"eSPAR!A49","v":0},{"$f":"eSPAR!B49","v":0},{"$f":"eSPAR!C49","v":0},{"$f":"eSPAR!D49","v":0},{"$f":"eSPAR!E49","v":0},{"$f":"eSPAR!F49","v":0},{"$f":"eSPAR!G49","v":0}]
[{"$f":"eSPAR!A50","v":0},{"$f":"eSPAR!B50","v":0},{"$f":"eSPAR!C50","v":0},{"$f":"eSPAR!D50","v":0},{"$f":"eSPAR!E50","v":0},{"$f":"eSPAR!F50","v":0},{"$f":"eSPAR!G50","v":0}]
[{"$f":"eSPAR!A51","v":0},{"$f":"eSPAR!B51","v":0},{"$f":"eSPAR!C51","v":0},{"$f":"eSPAR!D51","v":0},{"$f":"eSPAR!E51","v":0},{"$f":"eSPAR!F51","v":0},{"$f":"eSPAR!G51","v":0}]
[{"$f":"eSPAR!A52","v":0},{"$f":"eSPAR!B52","v":0},{"$f":"eSPAR!C52","v":0},{"$f":"eSPAR!D52","v":0},{"$f":"eSPAR!E52","v":0},{"$f":"eSPAR!F52","v":0},{"$f":"eSPAR!G52","v":0}]
[{"$f":"eSPAR!A53","v":0},{"$f":"eSPAR!B53","v":0},{"$f":"eSPAR!C53","v":0},{"$f":"eSPAR!D53","v":0},{"$f":"eSPAR!E53","v":0},{"$f":"eSPAR!F53","v":0},{"$f":"eSPAR!G53","v":0}]
[{"$f":"eSPAR!A54","v":0},{"$f":"eSPAR!B54","v":0},{"$f":"eSPAR!C54","v":0},{"$f":"eSPAR!D54","v":0},{"$f":"eSPAR!E54","v":0},{"$f":"eSPAR!F54","v":0},{"$f":"eSPAR!G54","v":0}]
[{"$f":"eSPAR!A55","v":0},{"$f":"eSPAR!B55","v":0},{"$f":"eSPAR!C55","v":0},{"$f":"eSPAR!D55","v":0},{"$f":"eSPAR!E55","v":0},{"$f":"eSPAR!F55","v":0},{"$f":"eSPAR!G55","v":0}]
[{"$f":"eSPAR!A56","v":0},{"$f":"eSPAR!B56","v":0},{"$f":"eSPAR!C56","v":0},{"$f":"eSPAR!D56","v":0},{"$f":"eSPAR!E56","v":0},{"$f":"eSPAR!F56","v":0},{"$f":"eSPAR!G56","v":0}]
[{"$f":"eSPAR!A57","v":0},{"$f":"eSPAR!B57","v":0},{"$f":"eSPAR!C57","v":0},{"$f":"eSPAR!D57","v":0},{"$f":"eSPAR!E57","v":0},{"$f":"eSPAR!F57","v":0},{"$f":"eSPAR!G57","v":0}]
[{"$f":"eSPAR!A58","v":0},{"$f":"eSPAR!B58","v":0},{"$f":"eSPAR!C58","v":0},{"$f":"eSPAR!D58","v":0},{"$f":"eSPAR!E58","v":0},{"$f":"eSPAR!F58","v":0},{"$f":"eSPAR!G58","v":0}]
[{"$f":"eSPAR!A59","v":0},{"$f":"eSPAR!B59","v":0},{"$f":"eSPAR!C59","v":0},{"$f":"eSPAR!D59","v":0},{"$f":"eSPAR!E59","v":0},{"$f":"eSPAR!F59","v":0},{"$f":"eSPAR!G59","v":0}]
[{"$f":"eSPAR!A60","v":0},{"$f":"eSPAR!B60","v":0},{"$f":"eSPAR!C60","v":0},{"$f":"eSPAR!D60","v":0},{"$f":"eSPAR!E60","v":0},{"$f":"eSPAR!F60","v":0},{"$f":"eSPAR!G60","v":0}]
[{"$f":"eSPAR!A61","v":0},{"$f":"eSPAR!B61","v":0},{"$f":"eSPAR!C61","v":0},{"$f":"eSPAR!D61","v":0},{"$f":"eSPAR!E61","v":0},{"$f":"eSPAR!F61","v":0},{"$f":"eSPAR!G61","v":0}]
[{"$f":"eSPAR!A62","v":0},{"$f":"eSPAR!B62","v":0},{"$f":"eSPAR!C62","v":0},{"$f":"eSPAR!D62","v":0},{"$f":"eSPAR!E62","v":0},{"$f":"eSPAR!F62","v":0},{"$f":"eSPAR!G62","v":0}]
[{"$f":"eSPAR!A63","v":0},{"$f":"eSPAR!B63","v":0},{"$f":"eSPAR!C63","v":0},{"$f":"eSPAR!D63","v":0},{"$f":"eSPAR!E63","v":0},{"$f":"eSPAR!F63","v":0},{"$f":"eSPAR!G63","v":0}]
[{"$f":"eSPAR!A64","v":0},{"$f":"eSPAR!B64","v":0},{"$f":"eSPAR!C64","v":0},{"$f":"eSPAR!D64","v":0},{"$f":"eSPAR!E64","v":0},{"$f":"eSPAR!F64","v":0},{"$f":"eSPAR!G64","v":0}]
[{"$f":"eSPAR!A65","v":0},{"$f":"eSPAR!B65","v":0},{"$f":"eSPAR!C65","v":0},{"$f":"eSPAR!D65","v":0},{"$f":"eSPAR!E65","v":0},{"$f":"eSPAR!F65","v":0},{"$f":"eSPAR!G65","v":0}]
[{"$f":"eSPAR!A66","v":0},{"$f":"eSPAR!B66","v":0},{"$f":"eSPAR!C66","v":0},{"$f":"eSPAR!D66","v":0},{"$f":"eSPAR!E66","v":0},{"$f":"eSPAR!F66","v":0},{"$f":"eSPAR!G66","v":0}]
[{"$f":"eSPAR!A67","v":0},{"$f":"eSPAR!B67","v":0},{"$f":"eSPAR!C67","v":0},{"$f":"eSPAR!D67","v":0},{"$f":"eSPAR!E67","v":0},{"$f":"eSPAR!F67","v":0},{"$f":"eSPAR!G67","v":0}]
[{"$f":"eSPAR!A68","v":0},{"$f":"eSPAR!B68","v":0},{"$f":"eSPAR!C68","v":0},{"$f":"eSPAR!D68","v":0},{"$f":"eSPAR!E68","v":0},{"$f":"eSPAR!F68","v":0},{"$f":"eSPAR!G68","v":0}]
[{"$f":"eSPAR!A69","v":0},{"$f":"eSPAR!B69","v":0},{"$f":"eSPAR!C69","v":0},{"$f":"eSPAR!D69","v":0},{"$f":"eSPAR!E69","v":0},{"$f":"eSPAR!F69","v":0},{"$f":"eSPAR!G69","v":0}]
[{"$f":"eSPAR!A70","v":0},{"$f":"eSPAR!B70","v":0},{"$f":"eSPAR!C70","v":0},{"$f":"eSPAR!D70","v":0},{"$f":"eSPAR!E70","v":0},{"$f":"eSPAR!F70","v":0},{"$f":"eSPAR!G70","v":0}]
[{"$f":"eSPAR!A71","v":0},{"$f":"eSPAR!B71","v":0},{"$f":"eSPAR!C71","v":0},{"$f":"eSPAR!D71","v":0},{"$f":"eSPAR!E71","v":0},{"$f":"eSPAR!F71","v":0},{"$f":"eSPAR!G71","v":0}]
[{"$f":"eSPAR!A72","v":0},{"$f":"eSPAR!B72","v":0},{"$f":"eSPAR!C72","v":0},{"$f":"eSPAR!D72","v":0},{"$f":"eSPAR!E72","v":0},{"$f":"eSPAR!F72","v":0},{"$f":"eSPAR!G72","v":0}]
[{"$f":"eSPAR!A73","v":0},{"$f":"eSPAR!B73","v":0},{"$f":"eSPAR!C73","v":0},{"$f":"eSPAR!D73","v":0},{"$f":"eSPAR!E73","v":0},{"$f":"eSPAR!F73","v":0},{"$f":"eSPAR!G73","v":0}]
[{"$f":"eSPAR!A74","v":0},{"$f":"eSPAR!B74","v":0},{"$f":"eSPAR!C74","v":0},{"$f":"eSPAR!D74","v":0},{"$f":"eSPAR!E74","v":0},{"$f":"eSPAR!F74","v":0},{"$f":"eSPAR!G74","v":0}]
[{"$f":"eSPAR!A75","v":0},{"$f":"eSPAR!B75","v":0},{"$f":"eSPAR!C75","v":0},{"$f":"eSPAR!D75","v":0},{"$f":"eSPAR!E75","v":0},{"$f":"eSPAR!F75","v":0},{"$f":"eSPAR!G75","v":0}]
[{"$f":"eSPAR!A76","v":0},{"$f":"eSPAR!B76","v":0},{"$f":"eSPAR!C76","v":0},{"$f":"eSPAR!D76","v":0},{"$f":"eSPAR!E76","v":0},{"$f":"eSPAR!F76","v":0},{"$f":"eSPAR!G76","v":0}]
[{"$f":"eSPAR!A77","v":0},{"$f":"eSPAR!B77","v":0},{"$f":"eSPAR!C77","v":0},{"$f":"eSPAR!D77","v":0},{"$f":"eSPAR!E77","v":0},{"$f":"eSPAR!F77","v":0},{"$f":"eSPAR!G77","v":0}]
[{"$f":"eSPAR!A78","v":0},{"$f":"eSPAR!B78","v":0},{"$f":"eSPAR!C78","v":0},{"$f":"eSPAR!D78","v":0},{"$f":"eSPAR!E78","v":0},{"$f":"eSPAR!F78","v":0},{"$f":"eSPAR!G78","v":0}]
[{"$f":"eSPAR!A79","v":0},{"$f":"eSPAR!B79","v":0},{"$f":"eSPAR!C79","v":0},{"$f":"eSPAR!D79","v":0},{"$f":"eSPAR!E79","v":0},{"$f":"eSPAR!F79","v":0},{"$f":"eSPAR!G79","v":0}]
[{"$f":"eSPAR!A80","v":0},{"$f":"eSPAR!B80","v":0},{"$f":"eSPAR!C80","v":0},{"$f":"eSPAR!D80","v":0},{"$f":"eSPAR!E80","v":0},{"$f":"eSPAR!F80","v":0},{"$f":"eSPAR!G80","v":0}]
[{"$f":"eSPAR!A81","v":0},{"$f":"eSPAR!B81","v":0},{"$f":"eSPAR!C81","v":0},{"$f":"eSPAR!D81","v":0},{"$f":"eSPAR!E81","v":0},{"$f":"eSPAR!F81","v":0},{"$f":"eSPAR!G81","v":0}]
[{"$f":"eSPAR!A82","v":0},{"$f":"eSPAR!B82","v":0},{"$f":"eSPAR!C82","v":0},{"$f":"eSPAR!D82","v":0},{"$f":"eSPAR!E82","v":0},{"$f":"eSPAR!F82","v":0},{"$f":"eSPAR!G82","v":0}]
[{"$f":"eSPAR!A83","v":0},{"$f":"eSPAR!B83","v":0},{"$f":"eSPAR!C83","v":0},{"$f":"eSPAR!D83","v":0},{"$f":"eSPAR!E83","v":0},{"$f":"eSPAR!F83","v":0},{"$f":"eSPAR!G83","v":0}]
[{"$f":"eSPAR!A84","v":0},{"$f":"eSPAR!B84","v":0},{"$f":"eSPAR!C84","v":0},{"$f":"eSPAR!D84","v":0},{"$f":"eSPAR!E84","v":0},{"$f":"eSPAR!F84","v":0},{"$f":"eSPAR!G84","v":0}]
[{"$f":"eSPAR!A85","v":0},{"$f":"eSPAR!B85","v":0},{"$f":"eSPAR!C85","v":0},{"$f":"eSPAR!D85","v":0},{"$f":"eSPAR!E85","v":0},{"$f":"eSPAR!F85","v":0},{"$f":"eSPAR!G85","v":0}]

{"sheet":"pRCPT1","index":9,"n_rows":34,"n_cols":12,"rows_kept":34,"cut":false,"hidden":false,"merged":[[6,0,6,12],[7,0,7,12],[8,0,8,12],[10,8,10,9],[0,0,0,12],[1,1,1,9],[2,1,2,9],[3,0,3,12],[5,0,5,4],[10,1,10,6],[18,0,19,0],[15,1,15,5],[16,0,17,0],[16,1,17,12],[14,1,14,12],[18,1,19,12],[20,1,20,12],[21,1,21,12],[22,1,22,12],[23,1,23,12],[24,1,24,12],[25,1,25,12],[26,1,26,12],[31,2,31,3],[33,0,33,1],[33,4,33,6],[33,10,33,12],[27,0,27,12],[11,1,11,6],[12,1,12,6],[13,1,13,6],[12,11,12,12],[12,8,12,10]]}
[{"$f":"Internal!C25","v":"Golden Valley School"}]
[null,{"$f":"\"Affiliated to CBSE, \"&\"Affiliation No.\"&\" \" & Internal!C26","v":"Affiliated to CBSE, Affiliation No. 124568"}]
[null,{"$f":"Internal!C27","v":"Hanuman Gali, Pushkar, Rajasthan"}]
[{"$f":"Internal!B30 & \",\" & \" \"& Internal!B29","v":"Ph. +91 999 999 9999, Email : demo@demomail.com"}]
[]
[]
["Report Card"]
[{"$f":"Internal!B34","v":"Class : IX"}]
[{"$f":"Internal!B33 & \" (Periodic Test 1)\"","v":"Academic Session: 2017-18 (Periodic Test 1)"}]
[]
["Student's Name",{"$f":"'pRCPT1-H'!B11:G11","v":"Aman Kumar"},null,null,null,null,null,null,"Roll No.",null,1]
["Father's Name",{"$f":"'pRCPT1-H'!B12:G12","v":"Naimesh Mehta"}]
["Mother's Name",{"$f":"'pRCPT1-H'!B13:G13","v":"Sheetal Rani"},null,null,null,null,null,null,"Admission No.",null,null,{"$f":"'pRCPT1-H'!L13:M13","v":"25445"}]
["Date of Birth",{"$f":"'pRCPT1-H'!B14:G14","v":"11/11/2001"}]
["Address",{"$f":"'pRCPT1-H'!B15:M15","v":"#44, Model Town, Hisar"}]
[]
["SCHOLASTIC AREA     ","Periodic Test  1 (PT 1)"]
[]
["Subjects","MM 10"]
[]
[{"$f":"eSUBMAR!B6","v":"English"},{"$f":"'pRCPT1-H'!B21:M21","v":7}]
[{"$f":"eSUBMAR!B7","v":"Hindi"},{"$f":"'pRCPT1-H'!B22:M22","v":6}]
[{"$f":"eSUBMAR!B8","v":"Mathematics"},{"$f":"'pRCPT1-H'!B23:M23","v":7}]
[{"$f":"eSUBMAR!B9","v":"Science"},{"$f":"'pRCPT1-H'!B24:M24","v":8}]
[{"$f":"eSUBMAR!B10","v":"Social Studies"},{"$f":"'pRCPT1-H'!B25:M25","v":8}]
[{"$f":"eSUBMAR!B11","v":"I.T."},{"$f":"'pRCPT1-H'!B26:M26","v":5}]
["Total",{"$f":"SUM(B21:G26)","v":41}]
[]
[]
[]
[]
[]
[]
[{"$f":"\"Date : \"&Main!H9","v":"Date : 18/12/2017"},null,null,null,"Class Teacher",null,null,null,null,null,"Principal"]

{"sheet":"pRCPT2","index":10,"n_rows":34,"n_cols":12,"rows_kept":34,"cut":false,"hidden":false,"merged":[[6,0,6,12],[18,1,19,12],[20,1,20,12],[21,1,21,12],[22,1,22,12],[18,0,19,0],[7,0,7,12],[8,0,8,12],[10,1,10,6],[10,8,10,9],[11,1,11,6],[12,1,12,6],[12,8,12,10],[12,11,12,12],[13,1,13,6],[14,1,14,12],[0,0,0,12],[1,1,1,9],[2,1,2,9],[3,0,3,12],[5,0,5,4],[15,1,15,5],[16,0,17,0],[16,1,17,12],[23,1,23,12],[24,1,24,12],[25,1,25,12],[33,0,33,1],[33,4,33,6],[33,10,33,12],[27,0,27,12],[31,2,31,3],[26,1,26,12]]}
[{"$f":"Internal!C25","v":"Golden Valley School"}]
[null,{"$f":"\"Affiliated to CBSE, \"&\"Affiliation No.\"&\" \" & Internal!C26","v":"Affiliated to CBSE, Affiliation No. 124568"}]
[null,{"$f":"Internal!C27","v":"Hanuman Gali, Pushkar, Rajasthan"}]
[{"$f":"Internal!B30 & \",\" & \" \"& Internal!B29","v":"Ph. +91 999 999 9999, Email : demo@demomail.com"}]
[]
[]
["Report Card"]
[{"$f":"Internal!B34","v":"Class : IX"}]
[{"$f":"Internal!B33 & \" (Periodic Test 2)\"","v":"Academic Session: 2017-18 (Periodic Test 2)"}]
[]
["Student's Name",{"$f":"'pRCPT2-H'!B11:G11","v":0},null,null,null,null,null,null,"Roll No.",null,1]
["Father's Name",{"$f":"'pRCPT2-H'!B12:G12","v":"Naimesh Mehta"}]
["Mother's Name",{"$f":"'pRCPT2-H'!B13:G13","v":"Sheetal Rani"},null,null,null,null,null,null,"Admission No.",null,null,{"$f":"'pRCPT2-H'!L13:M13","v":"25445"}]
["Date of Birth",{"$f":"'pRCPT2-H'!B14:G14","v":"11/11/2001"}]
["Address",{"$f":"'pRCPT2-H'!B15:M15","v":"#44, Model Town, Hisar"}]
[]
["SCHOLASTIC AREA     ","Periodic Test  2 (PT 2)"]
[]
["Subjects","MM 10"]
[]
[{"$f":"eSUBMAR!B6","v":"English"},{"$f":"'pRCPT2-H'!B21:M21","v":6}]
[{"$f":"eSUBMAR!B7","v":"Hindi"},{"$f":"'pRCPT2-H'!B22:M22","v":7}]
[{"$f":"eSUBMAR!B8","v":"Mathematics"},{"$f":"'pRCPT2-H'!B23:M23","v":5}]
[{"$f":"eSUBMAR!B9","v":"Science"},{"$f":"'pRCPT2-H'!B24:M24","v":6}]
[{"$f":"eSUBMAR!B10","v":"Social Studies"},{"$f":"'pRCPT2-H'!B25:M25","v":5}]
[{"$f":"eSUBMAR!B11","v":"I.T."},{"$f":"'pRCPT2-H'!B26:M26","v":6}]
["Total",{"$f":"SUM(B21:G26)","v":35}]
[]
[]
[]
[]
[]
[]
[{"$f":"\"Date : \"&Main!H9","v":"Date : 18/12/2017"},null,null,null,"Class Teacher",null,null,null,null,null,"Principal"]

{"sheet":"pRCPT3","index":11,"n_rows":34,"n_cols":12,"rows_kept":34,"cut":false,"hidden":false,"merged":[[12,1,12,6],[12,8,12,10],[12,11,12,12],[0,0,0,12],[1,1,1,9],[2,1,2,9],[3,0,3,12],[5,0,5,4],[6,0,6,12],[7,0,7,12],[8,0,8,12],[10,1,10,6],[10,8,10,9],[11,1,11,6],[25,1,25,12],[13,1,13,6],[14,1,14,12],[15,1,15,5],[16,0,17,0],[16,1,17,12],[18,0,19,0],[18,1,19,12],[20,1,20,12],[21,1,21,12],[22,1,22,12],[23,1,23,12],[24,1,24,12],[31,2,31,3],[33,0,33,1],[33,4,33,6],[33,10,33,12],[26,1,26,12],[27,0,27,12]]}
[{"$f":"Internal!C25","v":"Golden Valley School"}]
[null,{"$f":"\"Affiliated to CBSE, \"&\"Affiliation No.\"&\" \" & Internal!C26","v":"Affiliated to CBSE, Affiliation No. 124568"}]
[null,{"$f":"Internal!C27","v":"Hanuman Gali, Pushkar, Rajasthan"}]
[{"$f":"Internal!B30 & \",\" & \" \"& Internal!B29","v":"Ph. +91 999 999 9999, Email : demo@demomail.com"}]
[]
[]
["Report Card"]
[{"$f":"Internal!B34","v":"Class : IX"}]
[{"$f":"Internal!B33 & \" (Periodic Test 3)\"","v":"Academic Session: 2017-18 (Periodic Test 3)"}]
[]
["Student's Name",{"$f":"'pRCPT3-H'!B11:G11","v":"Aman Kumar"},null,null,null,null,null,null,"Roll No.",null,1]
["Father's Name",{"$f":"'pRCPT3-H'!B12:G12","v":"Naimesh Mehta"}]
["Mother's Name",{"$f":"'pRCPT3-H'!B13:G13","v":"Sheetal Rani"},null,null,null,null,null,null,"Admission No.",null,null,{"$f":"'pRCPT3-H'!L13:M13","v":"25445"}]
["Date of Birth",{"$f":"'pRCPT3-H'!B14:G14","v":"11/11/2001"}]
["Address",{"$f":"'pRCPT3-H'!B15:M15","v":"#44, Model Town, Hisar"}]
[]
["SCHOLASTIC AREA     ","Periodic Test  3 (PT 3)"]
[]
["Subjects","MM 10"]
[]
[{"$f":"eSUBMAR!B6","v":"English"},{"$f":"'pRCPT3-H'!B21:M21","v":7}]
[{"$f":"eSUBMAR!B7","v":"Hindi"},{"$f":"'pRCPT3-H'!B22:M22","v":8}]
[{"$f":"eSUBMAR!B8","v":"Mathematics"},{"$f":"'pRCPT3-H'!B23:M23","v":9}]
[{"$f":"eSUBMAR!B9","v":"Science"},{"$f":"'pRCPT3-H'!B24:M24","v":6}]
[{"$f":"eSUBMAR!B10","v":"Social Studies"},{"$f":"'pRCPT3-H'!B25:M25","v":7}]
[{"$f":"eSUBMAR!B11","v":"I.T."},{"$f":"'pRCPT3-H'!B26:M26","v":8}]
["Total",{"$f":"SUM(B21:G26)","v":45}]
[]
[]
[]
[]
[]
[]
[{"$f":"\"Date : \"&Main!H9","v":"Date : 18/12/2017"},null,null,null,"Class Teacher",null,null,null,null,null,"Principal"]

{"sheet":"pPT1","index":12,"n_rows":86,"n_cols":8,"rows_kept":86,"cut":false,"hidden":false,"merged":[[3,6,4,6],[0,0,0,7],[1,0,1,7],[2,0,2,7],[3,0,5,0],[3,1,4,1],[3,2,4,2],[3,3,4,3],[3,4,4,4],[3,5,4,5],[3,7,4,7]]}
[{"$f":"Internal!C25","v":"Golden Valley School"}]
[{"$f":"Internal!B34","v":"Class : IX"}]
[{"$f":"\"Periodic Test 1 (\"&Internal!B33&\")\"","v":"Periodic Test 1 (Academic Session: 2017-18)"}]
["Roll No.","Name",{"$f":"eSUBMAR!B6","v":"English"},{"$f":"eSUBMAR!B7","v":"Hindi"},{"$f":"eSUBMAR!B8","v":"Mathematics"},{"$f":"eSUBMAR!B9","v":"Science"},{"$f":"eSUBMAR!B10","v":"Social Studies"},{"$f":"eSUBMAR!B11","v":"I.T."}]
[]
[null,"Max. Marks>>",10,10,10,10,10,10]
[{"$f":"eSPAR!A6","v":1},{"$f":"eSPAR!B6","v":"Aman Kumar"},{"$f":"'pPT1-H'!C7","v":7},{"$f":"'pPT1-H'!D7","v":6},{"$f":"'pPT1-H'!E7","v":7},{"$f":"'pPT1-H'!F7","v":8},{"$f":"'pPT1-H'!G7","v":8},{"$f":"'pPT1-H'!H7","v":5}]
[{"$f":"eSPAR!A7","v":2},{"$f":"eSPAR!B7","v":0},{"$f":"'pPT1-H'!C8","v":0},{"$f":"'pPT1-H'!D8","v":0},{"$f":"'pPT1-H'!E8","v":0},{"$f":"'pPT1-H'!F8","v":0},{"$f":"'pPT1-H'!G8","v":0},{"$f":"'pPT1-H'!H8","v":0}]
[{"$f":"eSPAR!A8","v":0},{"$f":"eSPAR!B8","v":0},{"$f":"'pPT1-H'!C9","v":""},{"$f":"'pPT1-H'!D9","v":""},{"$f":"'pPT1-H'!E9","v":""},{"$f":"'pPT1-H'!F9","v":""},{"$f":"'pPT1-H'!G9","v":""},{"$f":"'pPT1-H'!H9","v":""}]
[{"$f":"eSPAR!A9","v":0},{"$f":"eSPAR!B9","v":0},{"$f":"'pPT1-H'!C10","v":""},{"$f":"'pPT1-H'!D10","v":""},{"$f":"'pPT1-H'!E10","v":""},{"$f":"'pPT1-H'!F10","v":""},{"$f":"'pPT1-H'!G10","v":""},{"$f":"'pPT1-H'!H10","v":""}]
[{"$f":"eSPAR!A10","v":0},{"$f":"eSPAR!B10","v":0},{"$f":"'pPT1-H'!C11","v":""},{"$f":"'pPT1-H'!D11","v":""},{"$f":"'pPT1-H'!E11","v":""},{"$f":"'pPT1-H'!F11","v":""},{"$f":"'pPT1-H'!G11","v":""},{"$f":"'pPT1-H'!H11","v":""}]
[{"$f":"eSPAR!A11","v":0},{"$f":"eSPAR!B11","v":0},{"$f":"'pPT1-H'!C12","v":""},{"$f":"'pPT1-H'!D12","v":""},{"$f":"'pPT1-H'!E12","v":""},{"$f":"'pPT1-H'!F12","v":""},{"$f":"'pPT1-H'!G12","v":""},{"$f":"'pPT1-H'!H12","v":""}]
[{"$f":"eSPAR!A12","v":0},{"$f":"eSPAR!B12","v":0},{"$f":"'pPT1-H'!C13","v":""},{"$f":"'pPT1-H'!D13","v":""},{"$f":"'pPT1-H'!E13","v":""},{"$f":"'pPT1-H'!F13","v":""},{"$f":"'pPT1-H'!G13","v":""},{"$f":"'pPT1-H'!H13","v":""}]
[{"$f":"eSPAR!A13","v":0},{"$f":"eSPAR!B13","v":0},{"$f":"'pPT1-H'!C14","v":""},{"$f":"'pPT1-H'!D14","v":""},{"$f":"'pPT1-H'!E14","v":""},{"$f":"'pPT1-H'!F14","v":""},{"$f":"'pPT1-H'!G14","v":""},{"$f":"'pPT1-H'!H14","v":""}]
[{"$f":"eSPAR!A14","v":0},{"$f":"eSPAR!B14","v":0},{"$f":"'pPT1-H'!C15","v":""},{"$f":"'pPT1-H'!D15","v":""},{"$f":"'pPT1-H'!E15","v":""},{"$f":"'pPT1-H'!F15","v":""},{"$f":"'pPT1-H'!G15","v":""},{"$f":"'pPT1-H'!H15","v":""}]
[{"$f":"eSPAR!A15","v":0},{"$f":"eSPAR!B15","v":0},{"$f":"'pPT1-H'!C16","v":""},{"$f":"'pPT1-H'!D16","v":""},{"$f":"'pPT1-H'!E16","v":""},{"$f":"'pPT1-H'!F16","v":""},{"$f":"'pPT1-H'!G16","v":""},{"$f":"'pPT1-H'!H16","v":""}]
[{"$f":"eSPAR!A16","v":0},{"$f":"eSPAR!B16","v":0},{"$f":"'pPT1-H'!C17","v":""},{"$f":"'pPT1-H'!D17","v":""},{"$f":"'pPT1-H'!E17","v":""},{"$f":"'pPT1-H'!F17","v":""},{"$f":"'pPT1-H'!G17","v":""},{"$f":"'pPT1-H'!H17","v":""}]
[{"$f":"eSPAR!A17","v":0},{"$f":"eSPAR!B17","v":0},{"$f":"'pPT1-H'!C18","v":""},{"$f":"'pPT1-H'!D18","v":""},{"$f":"'pPT1-H'!E18","v":""},{"$f":"'pPT1-H'!F18","v":""},{"$f":"'pPT1-H'!G18","v":""},{"$f":"'pPT1-H'!H18","v":""}]
[{"$f":"eSPAR!A18","v":0},{"$f":"eSPAR!B18","v":0},{"$f":"'pPT1-H'!C19","v":""},{"$f":"'pPT1-H'!D19","v":""},{"$f":"'pPT1-H'!E19","v":""},{"$f":"'pPT1-H'!F19","v":""},{"$f":"'pPT1-H'!G19","v":""},{"$f":"'pPT1-H'!H19","v":""}]
[{"$f":"eSPAR!A19","v":0},{"$f":"eSPAR!B19","v":0},{"$f":"'pPT1-H'!C20","v":""},{"$f":"'pPT1-H'!D20","v":""},{"$f":"'pPT1-H'!E20","v":""},{"$f":"'pPT1-H'!F20","v":""},{"$f":"'pPT1-H'!G20","v":""},{"$f":"'pPT1-H'!H20","v":""}]
[{"$f":"eSPAR!A20","v":0},{"$f":"eSPAR!B20","v":0},{"$f":"'pPT1-H'!C21","v":""},{"$f":"'pPT1-H'!D21","v":""},{"$f":"'pPT1-H'!E21","v":""},{"$f":"'pPT1-H'!F21","v":""},{"$f":"'pPT1-H'!G21","v":""},{"$f":"'pPT1-H'!H21","v":""}]
[{"$f":"eSPAR!A21","v":0},{"$f":"eSPAR!B21","v":0},{"$f":"'pPT1-H'!C22","v":""},{"$f":"'pPT1-H'!D22","v":""},{"$f":"'pPT1-H'!E22","v":""},{"$f":"'pPT1-H'!F22","v":""},{"$f":"'pPT1-H'!G22","v":""},{"$f":"'pPT1-H'!H22","v":""}]
[{"$f":"eSPAR!A22","v":0},{"$f":"eSPAR!B22","v":0},{"$f":"'pPT1-H'!C23","v":""},{"$f":"'pPT1-H'!D23","v":""},{"$f":"'pPT1-H'!E23","v":""},{"$f":"'pPT1-H'!F23","v":""},{"$f":"'pPT1-H'!G23","v":""},{"$f":"'pPT1-H'!H23","v":""}]
[{"$f":"eSPAR!A23","v":0},{"$f":"eSPAR!B23","v":0},{"$f":"'pPT1-H'!C24","v":""},{"$f":"'pPT1-H'!D24","v":""},{"$f":"'pPT1-H'!E24","v":""},{"$f":"'pPT1-H'!F24","v":""},{"$f":"'pPT1-H'!G24","v":""},{"$f":"'pPT1-H'!H24","v":""}]
[{"$f":"eSPAR!A24","v":0},{"$f":"eSPAR!B24","v":0},{"$f":"'pPT1-H'!C25","v":""},{"$f":"'pPT1-H'!D25","v":""},{"$f":"'pPT1-H'!E25","v":""},{"$f":"'pPT1-H'!F25","v":""},{"$f":"'pPT1-H'!G25","v":""},{"$f":"'pPT1-H'!H25","v":""}]
[{"$f":"eSPAR!A25","v":0},{"$f":"eSPAR!B25","v":0},{"$f":"'pPT1-H'!C26","v":""},{"$f":"'pPT1-H'!D26","v":""},{"$f":"'pPT1-H'!E26","v":""},{"$f":"'pPT1-H'!F26","v":""},{"$f":"'pPT1-H'!G26","v":""},{"$f":"'pPT1-H'!H26","v":""}]
[{"$f":"eSPAR!A26","v":0},{"$f":"eSPAR!B26","v":0},{"$f":"'pPT1-H'!C27","v":""},{"$f":"'pPT1-H'!D27","v":""},{"$f":"'pPT1-H'!E27","v":""},{"$f":"'pPT1-H'!F27","v":""},{"$f":"'pPT1-H'!G27","v":""},{"$f":"'pPT1-H'!H27","v":""}]
[{"$f":"eSPAR!A27","v":0},{"$f":"eSPAR!B27","v":0},{"$f":"'pPT1-H'!C28","v":""},{"$f":"'pPT1-H'!D28","v":""},{"$f":"'pPT1-H'!E28","v":""},{"$f":"'pPT1-H'!F28","v":""},{"$f":"'pPT1-H'!G28","v":""},{"$f":"'pPT1-H'!H28","v":""}]
[{"$f":"eSPAR!A28","v":0},{"$f":"eSPAR!B28","v":0},{"$f":"'pPT1-H'!C29","v":""},{"$f":"'pPT1-H'!D29","v":""},{"$f":"'pPT1-H'!E29","v":""},{"$f":"'pPT1-H'!F29","v":""},{"$f":"'pPT1-H'!G29","v":""},{"$f":"'pPT1-H'!H29","v":""}]
[{"$f":"eSPAR!A29","v":0},{"$f":"eSPAR!B29","v":0},{"$f":"'pPT1-H'!C30","v":""},{"$f":"'pPT1-H'!D30","v":""},{"$f":"'pPT1-H'!E30","v":""},{"$f":"'pPT1-H'!F30","v":""},{"$f":"'pPT1-H'!G30","v":""},{"$f":"'pPT1-H'!H30","v":""}]
[{"$f":"eSPAR!A30","v":0},{"$f":"eSPAR!B30","v":0},{"$f":"'pPT1-H'!C31","v":""},{"$f":"'pPT1-H'!D31","v":""},{"$f":"'pPT1-H'!E31","v":""},{"$f":"'pPT1-H'!F31","v":""},{"$f":"'pPT1-H'!G31","v":""},{"$f":"'pPT1-H'!H31","v":""}]
[{"$f":"eSPAR!A31","v":0},{"$f":"eSPAR!B31","v":0},{"$f":"'pPT1-H'!C32","v":""},{"$f":"'pPT1-H'!D32","v":""},{"$f":"'pPT1-H'!E32","v":""},{"$f":"'pPT1-H'!F32","v":""},{"$f":"'pPT1-H'!G32","v":""},{"$f":"'pPT1-H'!H32","v":""}]
[{"$f":"eSPAR!A32","v":0},{"$f":"eSPAR!B32","v":0},{"$f":"'pPT1-H'!C33","v":""},{"$f":"'pPT1-H'!D33","v":""},{"$f":"'pPT1-H'!E33","v":""},{"$f":"'pPT1-H'!F33","v":""},{"$f":"'pPT1-H'!G33","v":""},{"$f":"'pPT1-H'!H33","v":""}]
[{"$f":"eSPAR!A33","v":0},{"$f":"eSPAR!B33","v":0},{"$f":"'pPT1-H'!C34","v":""},{"$f":"'pPT1-H'!D34","v":""},{"$f":"'pPT1-H'!E34","v":""},{"$f":"'pPT1-H'!F34","v":""},{"$f":"'pPT1-H'!G34","v":""},{"$f":"'pPT1-H'!H34","v":""}]
[{"$f":"eSPAR!A34","v":0},{"$f":"eSPAR!B34","v":0},{"$f":"'pPT1-H'!C35","v":""},{"$f":"'pPT1-H'!D35","v":""},{"$f":"'pPT1-H'!E35","v":""},{"$f":"'pPT1-H'!F35","v":""},{"$f":"'pPT1-H'!G35","v":""},{"$f":"'pPT1-H'!H35","v":""}]
[{"$f":"eSPAR!A35","v":0},{"$f":"eSPAR!B35","v":0},{"$f":"'pPT1-H'!C36","v":""},{"$f":"'pPT1-H'!D36","v":""},{"$f":"'pPT1-H'!E36","v":""},{"$f":"'pPT1-H'!F36","v":""},{"$f":"'pPT1-H'!G36","v":""},{"$f":"'pPT1-H'!H36","v":""}]
[{"$f":"eSPAR!A36","v":0},{"$f":"eSPAR!B36","v":0},{"$f":"'pPT1-H'!C37","v":""},{"$f":"'pPT1-H'!D37","v":""},{"$f":"'pPT1-H'!E37","v":""},{"$f":"'pPT1-H'!F37","v":""},{"$f":"'pPT1-H'!G37","v":""},{"$f":"'pPT1-H'!H37","v":""}]
[{"$f":"eSPAR!A37","v":0},{"$f":"eSPAR!B37","v":0},{"$f":"'pPT1-H'!C38","v":""},{"$f":"'pPT1-H'!D38","v":""},{"$f":"'pPT1-H'!E38","v":""},{"$f":"'pPT1-H'!F38","v":""},{"$f":"'pPT1-H'!G38","v":""},{"$f":"'pPT1-H'!H38","v":""}]
[{"$f":"eSPAR!A38","v":0},{"$f":"eSPAR!B38","v":0},{"$f":"'pPT1-H'!C39","v":""},{"$f":"'pPT1-H'!D39","v":""},{"$f":"'pPT1-H'!E39","v":""},{"$f":"'pPT1-H'!F39","v":""},{"$f":"'pPT1-H'!G39","v":""},{"$f":"'pPT1-H'!H39","v":""}]
[{"$f":"eSPAR!A39","v":0},{"$f":"eSPAR!B39","v":0},{"$f":"'pPT1-H'!C40","v":""},{"$f":"'pPT1-H'!D40","v":""},{"$f":"'pPT1-H'!E40","v":""},{"$f":"'pPT1-H'!F40","v":""},{"$f":"'pPT1-H'!G40","v":""},{"$f":"'pPT1-H'!H40","v":""}]
[{"$f":"eSPAR!A40","v":0},{"$f":"eSPAR!B40","v":0},{"$f":"'pPT1-H'!C41","v":""},{"$f":"'pPT1-H'!D41","v":""},{"$f":"'pPT1-H'!E41","v":""},{"$f":"'pPT1-H'!F41","v":""},{"$f":"'pPT1-H'!G41","v":""},{"$f":"'pPT1-H'!H41","v":""}]
[{"$f":"eSPAR!A41","v":0},{"$f":"eSPAR!B41","v":0},{"$f":"'pPT1-H'!C42","v":""},{"$f":"'pPT1-H'!D42","v":""},{"$f":"'pPT1-H'!E42","v":""},{"$f":"'pPT1-H'!F42","v":""},{"$f":"'pPT1-H'!G42","v":""},{"$f":"'pPT1-H'!H42","v":""}]
[{"$f":"eSPAR!A42","v":0},{"$f":"eSPAR!B42","v":0},{"$f":"'pPT1-H'!C43","v":""},{"$f":"'pPT1-H'!D43","v":""},{"$f":"'pPT1-H'!E43","v":""},{"$f":"'pPT1-H'!F43","v":""},{"$f":"'pPT1-H'!G43","v":""},{"$f":"'pPT1-H'!H43","v":""}]
[{"$f":"eSPAR!A43","v":0},{"$f":"eSPAR!B43","v":0},{"$f":"'pPT1-H'!C44","v":""},{"$f":"'pPT1-H'!D44","v":""},{"$f":"'pPT1-H'!E44","v":""},{"$f":"'pPT1-H'!F44","v":""},{"$f":"'pPT1-H'!G44","v":""},{"$f":"'pPT1-H'!H44","v":""}]
[{"$f":"eSPAR!A44","v":0},{"$f":"eSPAR!B44","v":0},{"$f":"'pPT1-H'!C45","v":""},{"$f":"'pPT1-H'!D45","v":""},{"$f":"'pPT1-H'!E45","v":""},{"$f":"'pPT1-H'!F45","v":""},{"$f":"'pPT1-H'!G45","v":""},{"$f":"'pPT1-H'!H45","v":""}]
[{"$f":"eSPAR!A45","v":0},{"$f":"eSPAR!B45","v":0},{"$f":"'pPT1-H'!C46","v":""},{"$f":"'pPT1-H'!D46","v":""},{"$f":"'pPT1-H'!E46","v":""},{"$f":"'pPT1-H'!F46","v":""},{"$f":"'pPT1-H'!G46","v":""},{"$f":"'pPT1-H'!H46","v":""}]
[{"$f":"eSPAR!A46","v":0},{"$f":"eSPAR!B46","v":0},{"$f":"'pPT1-H'!C47","v":""},{"$f":"'pPT1-H'!D47","v":""},{"$f":"'pPT1-H'!E47","v":""},{"$f":"'pPT1-H'!F47","v":""},{"$f":"'pPT1-H'!G47","v":""},{"$f":"'pPT1-H'!H47","v":""}]
[{"$f":"eSPAR!A47","v":0},{"$f":"eSPAR!B47","v":0},{"$f":"'pPT1-H'!C48","v":""},{"$f":"'pPT1-H'!D48","v":""},{"$f":"'pPT1-H'!E48","v":""},{"$f":"'pPT1-H'!F48","v":""},{"$f":"'pPT1-H'!G48","v":""},{"$f":"'pPT1-H'!H48","v":""}]
[{"$f":"eSPAR!A48","v":0},{"$f":"eSPAR!B48","v":0},{"$f":"'pPT1-H'!C49","v":""},{"$f":"'pPT1-H'!D49","v":""},{"$f":"'pPT1-H'!E49","v":""},{"$f":"'pPT1-H'!F49","v":""},{"$f":"'pPT1-H'!G49","v":""},{"$f":"'pPT1-H'!H49","v":""}]
[{"$f":"eSPAR!A49","v":0},{"$f":"eSPAR!B49","v":0},{"$f":"'pPT1-H'!C50","v":""},{"$f":"'pPT1-H'!D50","v":""},{"$f":"'pPT1-H'!E50","v":""},{"$f":"'pPT1-H'!F50","v":""},{"$f":"'pPT1-H'!G50","v":""},{"$f":"'pPT1-H'!H50","v":""}]
[{"$f":"eSPAR!A50","v":0},{"$f":"eSPAR!B50","v":0},{"$f":"'pPT1-H'!C51","v":""},{"$f":"'pPT1-H'!D51","v":""},{"$f":"'pPT1-H'!E51","v":""},{"$f":"'pPT1-H'!F51","v":""},{"$f":"'pPT1-H'!G51","v":""},{"$f":"'pPT1-H'!H51","v":""}]
[{"$f":"eSPAR!A51","v":0},{"$f":"eSPAR!B51","v":0},{"$f":"'pPT1-H'!C52","v":""},{"$f":"'pPT1-H'!D52","v":""},{"$f":"'pPT1-H'!E52","v":""},{"$f":"'pPT1-H'!F52","v":""},{"$f":"'pPT1-H'!G52","v":""},{"$f":"'pPT1-H'!H52","v":""}]
[{"$f":"eSPAR!A52","v":0},{"$f":"eSPAR!B52","v":0},{"$f":"'pPT1-H'!C53","v":""},{"$f":"'pPT1-H'!D53","v":""},{"$f":"'pPT1-H'!E53","v":""},{"$f":"'pPT1-H'!F53","v":""},{"$f":"'pPT1-H'!G53","v":""},{"$f":"'pPT1-H'!H53","v":""}]
[{"$f":"eSPAR!A53","v":0},{"$f":"eSPAR!B53","v":0},{"$f":"'pPT1-H'!C54","v":""},{"$f":"'pPT1-H'!D54","v":""},{"$f":"'pPT1-H'!E54","v":""},{"$f":"'pPT1-H'!F54","v":""},{"$f":"'pPT1-H'!G54","v":""},{"$f":"'pPT1-H'!H54","v":""}]
[{"$f":"eSPAR!A54","v":0},{"$f":"eSPAR!B54","v":0},{"$f":"'pPT1-H'!C55","v":""},{"$f":"'pPT1-H'!D55","v":""},{"$f":"'pPT1-H'!E55","v":""},{"$f":"'pPT1-H'!F55","v":""},{"$f":"'pPT1-H'!G55","v":""},{"$f":"'pPT1-H'!H55","v":""}]
[{"$f":"eSPAR!A55","v":0},{"$f":"eSPAR!B55","v":0},{"$f":"'pPT1-H'!C56","v":""},{"$f":"'pPT1-H'!D56","v":""},{"$f":"'pPT1-H'!E56","v":""},{"$f":"'pPT1-H'!F56","v":""},{"$f":"'pPT1-H'!G56","v":""},{"$f":"'pPT1-H'!H56","v":""}]
[{"$f":"eSPAR!A56","v":0},{"$f":"eSPAR!B56","v":0},{"$f":"'pPT1-H'!C57","v":""},{"$f":"'pPT1-H'!D57","v":""},{"$f":"'pPT1-H'!E57","v":""},{"$f":"'pPT1-H'!F57","v":""},{"$f":"'pPT1-H'!G57","v":""},{"$f":"'pPT1-H'!H57","v":""}]
[{"$f":"eSPAR!A57","v":0},{"$f":"eSPAR!B57","v":0},{"$f":"'pPT1-H'!C58","v":""},{"$f":"'pPT1-H'!D58","v":""},{"$f":"'pPT1-H'!E58","v":""},{"$f":"'pPT1-H'!F58","v":""},{"$f":"'pPT1-H'!G58","v":""},{"$f":"'pPT1-H'!H58","v":""}]
[{"$f":"eSPAR!A58","v":0},{"$f":"eSPAR!B58","v":0},{"$f":"'pPT1-H'!C59","v":""},{"$f":"'pPT1-H'!D59","v":""},{"$f":"'pPT1-H'!E59","v":""},{"$f":"'pPT1-H'!F59","v":""},{"$f":"'pPT1-H'!G59","v":""},{"$f":"'pPT1-H'!H59","v":""}]
[{"$f":"eSPAR!A59","v":0},{"$f":"eSPAR!B59","v":0},{"$f":"'pPT1-H'!C60","v":""},{"$f":"'pPT1-H'!D60","v":""},{"$f":"'pPT1-H'!E60","v":""},{"$f":"'pPT1-H'!F60","v":""},{"$f":"'pPT1-H'!G60","v":""},{"$f":"'pPT1-H'!H60","v":""}]
[{"$f":"eSPAR!A60","v":0},{"$f":"eSPAR!B60","v":0},{"$f":"'pPT1-H'!C61","v":""},{"$f":"'pPT1-H'!D61","v":""},{"$f":"'pPT1-H'!E61","v":""},{"$f":"'pPT1-H'!F61","v":""},{"$f":"'pPT1-H'!G61","v":""},{"$f":"'pPT1-H'!H61","v":""}]
[{"$f":"eSPAR!A61","v":0},{"$f":"eSPAR!B61","v":0},{"$f":"'pPT1-H'!C62","v":""},{"$f":"'pPT1-H'!D62","v":""},{"$f":"'pPT1-H'!E62","v":""},{"$f":"'pPT1-H'!F62","v":""},{"$f":"'pPT1-H'!G62","v":""},{"$f":"'pPT1-H'!H62","v":""}]
[{"$f":"eSPAR!A62","v":0},{"$f":"eSPAR!B62","v":0},{"$f":"'pPT1-H'!C63","v":""},{"$f":"'pPT1-H'!D63","v":""},{"$f":"'pPT1-H'!E63","v":""},{"$f":"'pPT1-H'!F63","v":""},{"$f":"'pPT1-H'!G63","v":""},{"$f":"'pPT1-H'!H63","v":""}]
[{"$f":"eSPAR!A63","v":0},{"$f":"eSPAR!B63","v":0},{"$f":"'pPT1-H'!C64","v":""},{"$f":"'pPT1-H'!D64","v":""},{"$f":"'pPT1-H'!E64","v":""},{"$f":"'pPT1-H'!F64","v":""},{"$f":"'pPT1-H'!G64","v":""},{"$f":"'pPT1-H'!H64","v":""}]
[{"$f":"eSPAR!A64","v":0},{"$f":"eSPAR!B64","v":0},{"$f":"'pPT1-H'!C65","v":""},{"$f":"'pPT1-H'!D65","v":""},{"$f":"'pPT1-H'!E65","v":""},{"$f":"'pPT1-H'!F65","v":""},{"$f":"'pPT1-H'!G65","v":""},{"$f":"'pPT1-H'!H65","v":""}]
[{"$f":"eSPAR!A65","v":0},{"$f":"eSPAR!B65","v":0},{"$f":"'pPT1-H'!C66","v":""},{"$f":"'pPT1-H'!D66","v":""},{"$f":"'pPT1-H'!E66","v":""},{"$f":"'pPT1-H'!F66","v":""},{"$f":"'pPT1-H'!G66","v":""},{"$f":"'pPT1-H'!H66","v":""}]
[{"$f":"eSPAR!A66","v":0},{"$f":"eSPAR!B66","v":0},{"$f":"'pPT1-H'!C67","v":""},{"$f":"'pPT1-H'!D67","v":""},{"$f":"'pPT1-H'!E67","v":""},{"$f":"'pPT1-H'!F67","v":""},{"$f":"'pPT1-H'!G67","v":""},{"$f":"'pPT1-H'!H67","v":""}]
[{"$f":"eSPAR!A67","v":0},{"$f":"eSPAR!B67","v":0},{"$f":"'pPT1-H'!C68","v":""},{"$f":"'pPT1-H'!D68","v":""},{"$f":"'pPT1-H'!E68","v":""},{"$f":"'pPT1-H'!F68","v":""},{"$f":"'pPT1-H'!G68","v":""},{"$f":"'pPT1-H'!H68","v":""}]
[{"$f":"eSPAR!A68","v":0},{"$f":"eSPAR!B68","v":0},{"$f":"'pPT1-H'!C69","v":""},{"$f":"'pPT1-H'!D69","v":""},{"$f":"'pPT1-H'!E69","v":""},{"$f":"'pPT1-H'!F69","v":""},{"$f":"'pPT1-H'!G69","v":""},{"$f":"'pPT1-H'!H69","v":""}]
[{"$f":"eSPAR!A69","v":0},{"$f":"eSPAR!B69","v":0},{"$f":"'pPT1-H'!C70","v":""},{"$f":"'pPT1-H'!D70","v":""},{"$f":"'pPT1-H'!E70","v":""},{"$f":"'pPT1-H'!F70","v":""},{"$f":"'pPT1-H'!G70","v":""},{"$f":"'pPT1-H'!H70","v":""}]
[{"$f":"eSPAR!A70","v":0},{"$f":"eSPAR!B70","v":0},{"$f":"'pPT1-H'!C71","v":""},{"$f":"'pPT1-H'!D71","v":""},{"$f":"'pPT1-H'!E71","v":""},{"$f":"'pPT1-H'!F71","v":""},{"$f":"'pPT1-H'!G71","v":""},{"$f":"'pPT1-H'!H71","v":""}]
[{"$f":"eSPAR!A71","v":0},{"$f":"eSPAR!B71","v":0},{"$f":"'pPT1-H'!C72","v":""},{"$f":"'pPT1-H'!D72","v":""},{"$f":"'pPT1-H'!E72","v":""},{"$f":"'pPT1-H'!F72","v":""},{"$f":"'pPT1-H'!G72","v":""},{"$f":"'pPT1-H'!H72","v":""}]
[{"$f":"eSPAR!A72","v":0},{"$f":"eSPAR!B72","v":0},{"$f":"'pPT1-H'!C73","v":""},{"$f":"'pPT1-H'!D73","v":""},{"$f":"'pPT1-H'!E73","v":""},{"$f":"'pPT1-H'!F73","v":""},{"$f":"'pPT1-H'!G73","v":""},{"$f":"'pPT1-H'!H73","v":""}]
[{"$f":"eSPAR!A73","v":0},{"$f":"eSPAR!B73","v":0},{"$f":"'pPT1-H'!C74","v":""},{"$f":"'pPT1-H'!D74","v":""},{"$f":"'pPT1-H'!E74","v":""},{"$f":"'pPT1-H'!F74","v":""},{"$f":"'pPT1-H'!G74","v":""},{"$f":"'pPT1-H'!H74","v":""}]
[{"$f":"eSPAR!A74","v":0},{"$f":"eSPAR!B74","v":0},{"$f":"'pPT1-H'!C75","v":""},{"$f":"'pPT1-H'!D75","v":""},{"$f":"'pPT1-H'!E75","v":""},{"$f":"'pPT1-H'!F75","v":""},{"$f":"'pPT1-H'!G75","v":""},{"$f":"'pPT1-H'!H75","v":""}]
[{"$f":"eSPAR!A75","v":0},{"$f":"eSPAR!B75","v":0},{"$f":"'pPT1-H'!C76","v":""},{"$f":"'pPT1-H'!D76","v":""},{"$f":"'pPT1-H'!E76","v":""},{"$f":"'pPT1-H'!F76","v":""},{"$f":"'pPT1-H'!G76","v":""},{"$f":"'pPT1-H'!H76","v":""}]
[{"$f":"eSPAR!A76","v":0},{"$f":"eSPAR!B76","v":0},{"$f":"'pPT1-H'!C77","v":""},{"$f":"'pPT1-H'!D77","v":""},{"$f":"'pPT1-H'!E77","v":""},{"$f":"'pPT1-H'!F77","v":""},{"$f":"'pPT1-H'!G77","v":""},{"$f":"'pPT1-H'!H77","v":""}]
[{"$f":"eSPAR!A77","v":0},{"$f":"eSPAR!B77","v":0},{"$f":"'pPT1-H'!C78","v":""},{"$f":"'pPT1-H'!D78","v":""},{"$f":"'pPT1-H'!E78","v":""},{"$f":"'pPT1-H'!F78","v":""},{"$f":"'pPT1-H'!G78","v":""},{"$f":"'pPT1-H'!H78","v":""}]
[{"$f":"eSPAR!A78","v":0},{"$f":"eSPAR!B78","v":0},{"$f":"'pPT1-H'!C79","v":""},{"$f":"'pPT1-H'!D79","v":""},{"$f":"'pPT1-H'!E79","v":""},{"$f":"'pPT1-H'!F79","v":""},{"$f":"'pPT1-H'!G79","v":""},{"$f":"'pPT1-H'!H79","v":""}]
[{"$f":"eSPAR!A79","v":0},{"$f":"eSPAR!B79","v":0},{"$f":"'pPT1-H'!C80","v":""},{"$f":"'pPT1-H'!D80","v":""},{"$f":"'pPT1-H'!E80","v":""},{"$f":"'pPT1-H'!F80","v":""},{"$f":"'pPT1-H'!G80","v":""},{"$f":"'pPT1-H'!H80","v":""}]
[{"$f":"eSPAR!A80","v":0},{"$f":"eSPAR!B80","v":0},{"$f":"'pPT1-H'!C81","v":""},{"$f":"'pPT1-H'!D81","v":""},{"$f":"'pPT1-H'!E81","v":""},{"$f":"'pPT1-H'!F81","v":""},{"$f":"'pPT1-H'!G81","v":""},{"$f":"'pPT1-H'!H81","v":""}]
[{"$f":"eSPAR!A81","v":0},{"$f":"eSPAR!B81","v":0},{"$f":"'pPT1-H'!C82","v":""},{"$f":"'pPT1-H'!D82","v":""},{"$f":"'pPT1-H'!E82","v":""},{"$f":"'pPT1-H'!F82","v":""},{"$f":"'pPT1-H'!G82","v":""},{"$f":"'pPT1-H'!H82","v":""}]
[{"$f":"eSPAR!A82","v":0},{"$f":"eSPAR!B82","v":0},{"$f":"'pPT1-H'!C83","v":""},{"$f":"'pPT1-H'!D83","v":""},{"$f":"'pPT1-H'!E83","v":""},{"$f":"'pPT1-H'!F83","v":""},{"$f":"'pPT1-H'!G83","v":""},{"$f":"'pPT1-H'!H83","v":""}]
[{"$f":"eSPAR!A83","v":0},{"$f":"eSPAR!B83","v":0},{"$f":"'pPT1-H'!C84","v":""},{"$f":"'pPT1-H'!D84","v":""},{"$f":"'pPT1-H'!E84","v":""},{"$f":"'pPT1-H'!F84","v":""},{"$f":"'pPT1-H'!G84","v":""},{"$f":"'pPT1-H'!H84","v":""}]
[{"$f":"eSPAR!A84","v":0},{"$f":"eSPAR!B84","v":0},{"$f":"'pPT1-H'!C85","v":""},{"$f":"'pPT1-H'!D85","v":""},{"$f":"'pPT1-H'!E85","v":""},{"$f":"'pPT1-H'!F85","v":""},{"$f":"'pPT1-H'!G85","v":""},{"$f":"'pPT1-H'!H85","v":""}]
[{"$f":"eSPAR!A85","v":0},{"$f":"eSPAR!B85","v":0},{"$f":"'pPT1-H'!C86","v":""},{"$f":"'pPT1-H'!D86","v":""},{"$f":"'pPT1-H'!E86","v":""},{"$f":"'pPT1-H'!F86","v":""},{"$f":"'pPT1-H'!G86","v":""},{"$f":"'pPT1-H'!H86","v":""}]

{"sheet":"pPT2","index":13,"n_rows":86,"n_cols":8,"rows_kept":86,"cut":false,"hidden":false,"merged":[[0,0,0,7],[1,0,1,7],[2,0,2,7],[3,0,5,0],[3,1,4,1],[3,2,4,2],[3,3,4,3],[3,4,4,4],[3,5,4,5],[3,6,4,6],[3,7,4,7]]}
[{"$f":"Internal!C25","v":"Golden Valley School"}]
[{"$f":"Internal!B34","v":"Class : IX"}]
[{"$f":"\"Periodic Test 2 (\"&Internal!B33&\")\"","v":"Periodic Test 2 (Academic Session: 2017-18)"}]
["Roll No.","Name",{"$f":"eSUBMAR!B6","v":"English"},{"$f":"eSUBMAR!B7","v":"Hindi"},{"$f":"eSUBMAR!B8","v":"Mathematics"},{"$f":"eSUBMAR!B9","v":"Science"},{"$f":"eSUBMAR!B10","v":"Social Studies"},{"$f":"eSUBMAR!B11","v":"I.T."}]
[]
[null,"Max. Marks>>",10,10,10,10,10,10]
[{"$f":"eSPAR!A6","v":1},{"$f":"eSPAR!B6","v":"Aman Kumar"},{"$f":"'pPT2-H'!C7","v":6},{"$f":"'pPT2-H'!D7","v":7},{"$f":"'pPT2-H'!E7","v":5},{"$f":"'pPT2-H'!F7","v":6},{"$f":"'pPT2-H'!G7","v":5},{"$f":"'pPT2-H'!H7","v":6}]
[{"$f":"eSPAR!A7","v":2},{"$f":"eSPAR!B7","v":0},{"$f":"'pPT2-H'!C8","v":0},{"$f":"'pPT2-H'!D8","v":0},{"$f":"'pPT2-H'!E8","v":0},{"$f":"'pPT2-H'!F8","v":0},{"$f":"'pPT2-H'!G8","v":0},{"$f":"'pPT2-H'!H8","v":0}]
[{"$f":"eSPAR!A8","v":0},{"$f":"eSPAR!B8","v":0},{"$f":"'pPT2-H'!C9","v":""},{"$f":"'pPT2-H'!D9","v":""},{"$f":"'pPT2-H'!E9","v":""},{"$f":"'pPT2-H'!F9","v":""},{"$f":"'pPT2-H'!G9","v":""},{"$f":"'pPT2-H'!H9","v":""}]
[{"$f":"eSPAR!A9","v":0},{"$f":"eSPAR!B9","v":0},{"$f":"'pPT2-H'!C10","v":""},{"$f":"'pPT2-H'!D10","v":""},{"$f":"'pPT2-H'!E10","v":""},{"$f":"'pPT2-H'!F10","v":""},{"$f":"'pPT2-H'!G10","v":""},{"$f":"'pPT2-H'!H10","v":""}]
[{"$f":"eSPAR!A10","v":0},{"$f":"eSPAR!B10","v":0},{"$f":"'pPT2-H'!C11","v":""},{"$f":"'pPT2-H'!D11","v":""},{"$f":"'pPT2-H'!E11","v":""},{"$f":"'pPT2-H'!F11","v":""},{"$f":"'pPT2-H'!G11","v":""},{"$f":"'pPT2-H'!H11","v":""}]
[{"$f":"eSPAR!A11","v":0},{"$f":"eSPAR!B11","v":0},{"$f":"'pPT2-H'!C12","v":""},{"$f":"'pPT2-H'!D12","v":""},{"$f":"'pPT2-H'!E12","v":""},{"$f":"'pPT2-H'!F12","v":""},{"$f":"'pPT2-H'!G12","v":""},{"$f":"'pPT2-H'!H12","v":""}]
[{"$f":"eSPAR!A12","v":0},{"$f":"eSPAR!B12","v":0},{"$f":"'pPT2-H'!C13","v":""},{"$f":"'pPT2-H'!D13","v":""},{"$f":"'pPT2-H'!E13","v":""},{"$f":"'pPT2-H'!F13","v":""},{"$f":"'pPT2-H'!G13","v":""},{"$f":"'pPT2-H'!H13","v":""}]
[{"$f":"eSPAR!A13","v":0},{"$f":"eSPAR!B13","v":0},{"$f":"'pPT2-H'!C14","v":""},{"$f":"'pPT2-H'!D14","v":""},{"$f":"'pPT2-H'!E14","v":""},{"$f":"'pPT2-H'!F14","v":""},{"$f":"'pPT2-H'!G14","v":""},{"$f":"'pPT2-H'!H14","v":""}]
[{"$f":"eSPAR!A14","v":0},{"$f":"eSPAR!B14","v":0},{"$f":"'pPT2-H'!C15","v":""},{"$f":"'pPT2-H'!D15","v":""},{"$f":"'pPT2-H'!E15","v":""},{"$f":"'pPT2-H'!F15","v":""},{"$f":"'pPT2-H'!G15","v":""},{"$f":"'pPT2-H'!H15","v":""}]
[{"$f":"eSPAR!A15","v":0},{"$f":"eSPAR!B15","v":0},{"$f":"'pPT2-H'!C16","v":""},{"$f":"'pPT2-H'!D16","v":""},{"$f":"'pPT2-H'!E16","v":""},{"$f":"'pPT2-H'!F16","v":""},{"$f":"'pPT2-H'!G16","v":""},{"$f":"'pPT2-H'!H16","v":""}]
[{"$f":"eSPAR!A16","v":0},{"$f":"eSPAR!B16","v":0},{"$f":"'pPT2-H'!C17","v":""},{"$f":"'pPT2-H'!D17","v":""},{"$f":"'pPT2-H'!E17","v":""},{"$f":"'pPT2-H'!F17","v":""},{"$f":"'pPT2-H'!G17","v":""},{"$f":"'pPT2-H'!H17","v":""}]
[{"$f":"eSPAR!A17","v":0},{"$f":"eSPAR!B17","v":0},{"$f":"'pPT2-H'!C18","v":""},{"$f":"'pPT2-H'!D18","v":""},{"$f":"'pPT2-H'!E18","v":""},{"$f":"'pPT2-H'!F18","v":""},{"$f":"'pPT2-H'!G18","v":""},{"$f":"'pPT2-H'!H18","v":""}]
[{"$f":"eSPAR!A18","v":0},{"$f":"eSPAR!B18","v":0},{"$f":"'pPT2-H'!C19","v":""},{"$f":"'pPT2-H'!D19","v":""},{"$f":"'pPT2-H'!E19","v":""},{"$f":"'pPT2-H'!F19","v":""},{"$f":"'pPT2-H'!G19","v":""},{"$f":"'pPT2-H'!H19","v":""}]
[{"$f":"eSPAR!A19","v":0},{"$f":"eSPAR!B19","v":0},{"$f":"'pPT2-H'!C20","v":""},{"$f":"'pPT2-H'!D20","v":""},{"$f":"'pPT2-H'!E20","v":""},{"$f":"'pPT2-H'!F20","v":""},{"$f":"'pPT2-H'!G20","v":""},{"$f":"'pPT2-H'!H20","v":""}]
[{"$f":"eSPAR!A20","v":0},{"$f":"eSPAR!B20","v":0},{"$f":"'pPT2-H'!C21","v":""},{"$f":"'pPT2-H'!D21","v":""},{"$f":"'pPT2-H'!E21","v":""},{"$f":"'pPT2-H'!F21","v":""},{"$f":"'pPT2-H'!G21","v":""},{"$f":"'pPT2-H'!H21","v":""}]
[{"$f":"eSPAR!A21","v":0},{"$f":"eSPAR!B21","v":0},{"$f":"'pPT2-H'!C22","v":""},{"$f":"'pPT2-H'!D22","v":""},{"$f":"'pPT2-H'!E22","v":""},{"$f":"'pPT2-H'!F22","v":""},{"$f":"'pPT2-H'!G22","v":""},{"$f":"'pPT2-H'!H22","v":""}]
[{"$f":"eSPAR!A22","v":0},{"$f":"eSPAR!B22","v":0},{"$f":"'pPT2-H'!C23","v":""},{"$f":"'pPT2-H'!D23","v":""},{"$f":"'pPT2-H'!E23","v":""},{"$f":"'pPT2-H'!F23","v":""},{"$f":"'pPT2-H'!G23","v":""},{"$f":"'pPT2-H'!H23","v":""}]
[{"$f":"eSPAR!A23","v":0},{"$f":"eSPAR!B23","v":0},{"$f":"'pPT2-H'!C24","v":""},{"$f":"'pPT2-H'!D24","v":""},{"$f":"'pPT2-H'!E24","v":""},{"$f":"'pPT2-H'!F24","v":""},{"$f":"'pPT2-H'!G24","v":""},{"$f":"'pPT2-H'!H24","v":""}]
[{"$f":"eSPAR!A24","v":0},{"$f":"eSPAR!B24","v":0},{"$f":"'pPT2-H'!C25","v":""},{"$f":"'pPT2-H'!D25","v":""},{"$f":"'pPT2-H'!E25","v":""},{"$f":"'pPT2-H'!F25","v":""},{"$f":"'pPT2-H'!G25","v":""},{"$f":"'pPT2-H'!H25","v":""}]
[{"$f":"eSPAR!A25","v":0},{"$f":"eSPAR!B25","v":0},{"$f":"'pPT2-H'!C26","v":""},{"$f":"'pPT2-H'!D26","v":""},{"$f":"'pPT2-H'!E26","v":""},{"$f":"'pPT2-H'!F26","v":""},{"$f":"'pPT2-H'!G26","v":""},{"$f":"'pPT2-H'!H26","v":""}]
[{"$f":"eSPAR!A26","v":0},{"$f":"eSPAR!B26","v":0},{"$f":"'pPT2-H'!C27","v":""},{"$f":"'pPT2-H'!D27","v":""},{"$f":"'pPT2-H'!E27","v":""},{"$f":"'pPT2-H'!F27","v":""},{"$f":"'pPT2-H'!G27","v":""},{"$f":"'pPT2-H'!H27","v":""}]
[{"$f":"eSPAR!A27","v":0},{"$f":"eSPAR!B27","v":0},{"$f":"'pPT2-H'!C28","v":""},{"$f":"'pPT2-H'!D28","v":""},{"$f":"'pPT2-H'!E28","v":""},{"$f":"'pPT2-H'!F28","v":""},{"$f":"'pPT2-H'!G28","v":""},{"$f":"'pPT2-H'!H28","v":""}]
[{"$f":"eSPAR!A28","v":0},{"$f":"eSPAR!B28","v":0},{"$f":"'pPT2-H'!C29","v":""},{"$f":"'pPT2-H'!D29","v":""},{"$f":"'pPT2-H'!E29","v":""},{"$f":"'pPT2-H'!F29","v":""},{"$f":"'pPT2-H'!G29","v":""},{"$f":"'pPT2-H'!H29","v":""}]
[{"$f":"eSPAR!A29","v":0},{"$f":"eSPAR!B29","v":0},{"$f":"'pPT2-H'!C30","v":""},{"$f":"'pPT2-H'!D30","v":""},{"$f":"'pPT2-H'!E30","v":""},{"$f":"'pPT2-H'!F30","v":""},{"$f":"'pPT2-H'!G30","v":""},{"$f":"'pPT2-H'!H30","v":""}]
[{"$f":"eSPAR!A30","v":0},{"$f":"eSPAR!B30","v":0},{"$f":"'pPT2-H'!C31","v":""},{"$f":"'pPT2-H'!D31","v":""},{"$f":"'pPT2-H'!E31","v":""},{"$f":"'pPT2-H'!F31","v":""},{"$f":"'pPT2-H'!G31","v":""},{"$f":"'pPT2-H'!H31","v":""}]
[{"$f":"eSPAR!A31","v":0},{"$f":"eSPAR!B31","v":0},{"$f":"'pPT2-H'!C32","v":""},{"$f":"'pPT2-H'!D32","v":""},{"$f":"'pPT2-H'!E32","v":""},{"$f":"'pPT2-H'!F32","v":""},{"$f":"'pPT2-H'!G32","v":""},{"$f":"'pPT2-H'!H32","v":""}]
[{"$f":"eSPAR!A32","v":0},{"$f":"eSPAR!B32","v":0},{"$f":"'pPT2-H'!C33","v":""},{"$f":"'pPT2-H'!D33","v":""},{"$f":"'pPT2-H'!E33","v":""},{"$f":"'pPT2-H'!F33","v":""},{"$f":"'pPT2-H'!G33","v":""},{"$f":"'pPT2-H'!H33","v":""}]
[{"$f":"eSPAR!A33","v":0},{"$f":"eSPAR!B33","v":0},{"$f":"'pPT2-H'!C34","v":""},{"$f":"'pPT2-H'!D34","v":""},{"$f":"'pPT2-H'!E34","v":""},{"$f":"'pPT2-H'!F34","v":""},{"$f":"'pPT2-H'!G34","v":""},{"$f":"'pPT2-H'!H34","v":""}]
[{"$f":"eSPAR!A34","v":0},{"$f":"eSPAR!B34","v":0},{"$f":"'pPT2-H'!C35","v":""},{"$f":"'pPT2-H'!D35","v":""},{"$f":"'pPT2-H'!E35","v":""},{"$f":"'pPT2-H'!F35","v":""},{"$f":"'pPT2-H'!G35","v":""},{"$f":"'pPT2-H'!H35","v":""}]
[{"$f":"eSPAR!A35","v":0},{"$f":"eSPAR!B35","v":0},{"$f":"'pPT2-H'!C36","v":""},{"$f":"'pPT2-H'!D36","v":""},{"$f":"'pPT2-H'!E36","v":""},{"$f":"'pPT2-H'!F36","v":""},{"$f":"'pPT2-H'!G36","v":""},{"$f":"'pPT2-H'!H36","v":""}]
[{"$f":"eSPAR!A36","v":0},{"$f":"eSPAR!B36","v":0},{"$f":"'pPT2-H'!C37","v":""},{"$f":"'pPT2-H'!D37","v":""},{"$f":"'pPT2-H'!E37","v":""},{"$f":"'pPT2-H'!F37","v":""},{"$f":"'pPT2-H'!G37","v":""},{"$f":"'pPT2-H'!H37","v":""}]
[{"$f":"eSPAR!A37","v":0},{"$f":"eSPAR!B37","v":0},{"$f":"'pPT2-H'!C38","v":""},{"$f":"'pPT2-H'!D38","v":""},{"$f":"'pPT2-H'!E38","v":""},{"$f":"'pPT2-H'!F38","v":""},{"$f":"'pPT2-H'!G38","v":""},{"$f":"'pPT2-H'!H38","v":""}]
[{"$f":"eSPAR!A38","v":0},{"$f":"eSPAR!B38","v":0},{"$f":"'pPT2-H'!C39","v":""},{"$f":"'pPT2-H'!D39","v":""},{"$f":"'pPT2-H'!E39","v":""},{"$f":"'pPT2-H'!F39","v":""},{"$f":"'pPT2-H'!G39","v":""},{"$f":"'pPT2-H'!H39","v":""}]
[{"$f":"eSPAR!A39","v":0},{"$f":"eSPAR!B39","v":0},{"$f":"'pPT2-H'!C40","v":""},{"$f":"'pPT2-H'!D40","v":""},{"$f":"'pPT2-H'!E40","v":""},{"$f":"'pPT2-H'!F40","v":""},{"$f":"'pPT2-H'!G40","v":""},{"$f":"'pPT2-H'!H40","v":""}]
[{"$f":"eSPAR!A40","v":0},{"$f":"eSPAR!B40","v":0},{"$f":"'pPT2-H'!C41","v":""},{"$f":"'pPT2-H'!D41","v":""},{"$f":"'pPT2-H'!E41","v":""},{"$f":"'pPT2-H'!F41","v":""},{"$f":"'pPT2-H'!G41","v":""},{"$f":"'pPT2-H'!H41","v":""}]
[{"$f":"eSPAR!A41","v":0},{"$f":"eSPAR!B41","v":0},{"$f":"'pPT2-H'!C42","v":""},{"$f":"'pPT2-H'!D42","v":""},{"$f":"'pPT2-H'!E42","v":""},{"$f":"'pPT2-H'!F42","v":""},{"$f":"'pPT2-H'!G42","v":""},{"$f":"'pPT2-H'!H42","v":""}]
[{"$f":"eSPAR!A42","v":0},{"$f":"eSPAR!B42","v":0},{"$f":"'pPT2-H'!C43","v":""},{"$f":"'pPT2-H'!D43","v":""},{"$f":"'pPT2-H'!E43","v":""},{"$f":"'pPT2-H'!F43","v":""},{"$f":"'pPT2-H'!G43","v":""},{"$f":"'pPT2-H'!H43","v":""}]
[{"$f":"eSPAR!A43","v":0},{"$f":"eSPAR!B43","v":0},{"$f":"'pPT2-H'!C44","v":""},{"$f":"'pPT2-H'!D44","v":""},{"$f":"'pPT2-H'!E44","v":""},{"$f":"'pPT2-H'!F44","v":""},{"$f":"'pPT2-H'!G44","v":""},{"$f":"'pPT2-H'!H44","v":""}]
[{"$f":"eSPAR!A44","v":0},{"$f":"eSPAR!B44","v":0},{"$f":"'pPT2-H'!C45","v":""},{"$f":"'pPT2-H'!D45","v":""},{"$f":"'pPT2-H'!E45","v":""},{"$f":"'pPT2-H'!F45","v":""},{"$f":"'pPT2-H'!G45","v":""},{"$f":"'pPT2-H'!H45","v":""}]
[{"$f":"eSPAR!A45","v":0},{"$f":"eSPAR!B45","v":0},{"$f":"'pPT2-H'!C46","v":""},{"$f":"'pPT2-H'!D46","v":""},{"$f":"'pPT2-H'!E46","v":""},{"$f":"'pPT2-H'!F46","v":""},{"$f":"'pPT2-H'!G46","v":""},{"$f":"'pPT2-H'!H46","v":""}]
[{"$f":"eSPAR!A46","v":0},{"$f":"eSPAR!B46","v":0},{"$f":"'pPT2-H'!C47","v":""},{"$f":"'pPT2-H'!D47","v":""},{"$f":"'pPT2-H'!E47","v":""},{"$f":"'pPT2-H'!F47","v":""},{"$f":"'pPT2-H'!G47","v":""},{"$f":"'pPT2-H'!H47","v":""}]
[{"$f":"eSPAR!A47","v":0},{"$f":"eSPAR!B47","v":0},{"$f":"'pPT2-H'!C48","v":""},{"$f":"'pPT2-H'!D48","v":""},{"$f":"'pPT2-H'!E48","v":""},{"$f":"'pPT2-H'!F48","v":""},{"$f":"'pPT2-H'!G48","v":""},{"$f":"'pPT2-H'!H48","v":""}]
[{"$f":"eSPAR!A48","v":0},{"$f":"eSPAR!B48","v":0},{"$f":"'pPT2-H'!C49","v":""},{"$f":"'pPT2-H'!D49","v":""},{"$f":"'pPT2-H'!E49","v":""},{"$f":"'pPT2-H'!F49","v":""},{"$f":"'pPT2-H'!G49","v":""},{"$f":"'pPT2-H'!H49","v":""}]
[{"$f":"eSPAR!A49","v":0},{"$f":"eSPAR!B49","v":0},{"$f":"'pPT2-H'!C50","v":""},{"$f":"'pPT2-H'!D50","v":""},{"$f":"'pPT2-H'!E50","v":""},{"$f":"'pPT2-H'!F50","v":""},{"$f":"'pPT2-H'!G50","v":""},{"$f":"'pPT2-H'!H50","v":""}]
[{"$f":"eSPAR!A50","v":0},{"$f":"eSPAR!B50","v":0},{"$f":"'pPT2-H'!C51","v":""},{"$f":"'pPT2-H'!D51","v":""},{"$f":"'pPT2-H'!E51","v":""},{"$f":"'pPT2-H'!F51","v":""},{"$f":"'pPT2-H'!G51","v":""},{"$f":"'pPT2-H'!H51","v":""}]
[{"$f":"eSPAR!A51","v":0},{"$f":"eSPAR!B51","v":0},{"$f":"'pPT2-H'!C52","v":""},{"$f":"'pPT2-H'!D52","v":""},{"$f":"'pPT2-H'!E52","v":""},{"$f":"'pPT2-H'!F52","v":""},{"$f":"'pPT2-H'!G52","v":""},{"$f":"'pPT2-H'!H52","v":""}]
[{"$f":"eSPAR!A52","v":0},{"$f":"eSPAR!B52","v":0},{"$f":"'pPT2-H'!C53","v":""},{"$f":"'pPT2-H'!D53","v":""},{"$f":"'pPT2-H'!E53","v":""},{"$f":"'pPT2-H'!F53","v":""},{"$f":"'pPT2-H'!G53","v":""},{"$f":"'pPT2-H'!H53","v":""}]
[{"$f":"eSPAR!A53","v":0},{"$f":"eSPAR!B53","v":0},{"$f":"'pPT2-H'!C54","v":""},{"$f":"'pPT2-H'!D54","v":""},{"$f":"'pPT2-H'!E54","v":""},{"$f":"'pPT2-H'!F54","v":""},{"$f":"'pPT2-H'!G54","v":""},{"$f":"'pPT2-H'!H54","v":""}]
[{"$f":"eSPAR!A54","v":0},{"$f":"eSPAR!B54","v":0},{"$f":"'pPT2-H'!C55","v":""},{"$f":"'pPT2-H'!D55","v":""},{"$f":"'pPT2-H'!E55","v":""},{"$f":"'pPT2-H'!F55","v":""},{"$f":"'pPT2-H'!G55","v":""},{"$f":"'pPT2-H'!H55","v":""}]
[{"$f":"eSPAR!A55","v":0},{"$f":"eSPAR!B55","v":0},{"$f":"'pPT2-H'!C56","v":""},{"$f":"'pPT2-H'!D56","v":""},{"$f":"'pPT2-H'!E56","v":""},{"$f":"'pPT2-H'!F56","v":""},{"$f":"'pPT2-H'!G56","v":""},{"$f":"'pPT2-H'!H56","v":""}]
[{"$f":"eSPAR!A56","v":0},{"$f":"eSPAR!B56","v":0},{"$f":"'pPT2-H'!C57","v":""},{"$f":"'pPT2-H'!D57","v":""},{"$f":"'pPT2-H'!E57","v":""},{"$f":"'pPT2-H'!F57","v":""},{"$f":"'pPT2-H'!G57","v":""},{"$f":"'pPT2-H'!H57","v":""}]
[{"$f":"eSPAR!A57","v":0},{"$f":"eSPAR!B57","v":0},{"$f":"'pPT2-H'!C58","v":""},{"$f":"'pPT2-H'!D58","v":""},{"$f":"'pPT2-H'!E58","v":""},{"$f":"'pPT2-H'!F58","v":""},{"$f":"'pPT2-H'!G58","v":""},{"$f":"'pPT2-H'!H58","v":""}]
[{"$f":"eSPAR!A58","v":0},{"$f":"eSPAR!B58","v":0},{"$f":"'pPT2-H'!C59","v":""},{"$f":"'pPT2-H'!D59","v":""},{"$f":"'pPT2-H'!E59","v":""},{"$f":"'pPT2-H'!F59","v":""},{"$f":"'pPT2-H'!G59","v":""},{"$f":"'pPT2-H'!H59","v":""}]
[{"$f":"eSPAR!A59","v":0},{"$f":"eSPAR!B59","v":0},{"$f":"'pPT2-H'!C60","v":""},{"$f":"'pPT2-H'!D60","v":""},{"$f":"'pPT2-H'!E60","v":""},{"$f":"'pPT2-H'!F60","v":""},{"$f":"'pPT2-H'!G60","v":""},{"$f":"'pPT2-H'!H60","v":""}]
[{"$f":"eSPAR!A60","v":0},{"$f":"eSPAR!B60","v":0},{"$f":"'pPT2-H'!C61","v":""},{"$f":"'pPT2-H'!D61","v":""},{"$f":"'pPT2-H'!E61","v":""},{"$f":"'pPT2-H'!F61","v":""},{"$f":"'pPT2-H'!G61","v":""},{"$f":"'pPT2-H'!H61","v":""}]
[{"$f":"eSPAR!A61","v":0},{"$f":"eSPAR!B61","v":0},{"$f":"'pPT2-H'!C62","v":""},{"$f":"'pPT2-H'!D62","v":""},{"$f":"'pPT2-H'!E62","v":""},{"$f":"'pPT2-H'!F62","v":""},{"$f":"'pPT2-H'!G62","v":""},{"$f":"'pPT2-H'!H62","v":""}]
[{"$f":"eSPAR!A62","v":0},{"$f":"eSPAR!B62","v":0},{"$f":"'pPT2-H'!C63","v":""},{"$f":"'pPT2-H'!D63","v":""},{"$f":"'pPT2-H'!E63","v":""},{"$f":"'pPT2-H'!F63","v":""},{"$f":"'pPT2-H'!G63","v":""},{"$f":"'pPT2-H'!H63","v":""}]
[{"$f":"eSPAR!A63","v":0},{"$f":"eSPAR!B63","v":0},{"$f":"'pPT2-H'!C64","v":""},{"$f":"'pPT2-H'!D64","v":""},{"$f":"'pPT2-H'!E64","v":""},{"$f":"'pPT2-H'!F64","v":""},{"$f":"'pPT2-H'!G64","v":""},{"$f":"'pPT2-H'!H64","v":""}]
[{"$f":"eSPAR!A64","v":0},{"$f":"eSPAR!B64","v":0},{"$f":"'pPT2-H'!C65","v":""},{"$f":"'pPT2-H'!D65","v":""},{"$f":"'pPT2-H'!E65","v":""},{"$f":"'pPT2-H'!F65","v":""},{"$f":"'pPT2-H'!G65","v":""},{"$f":"'pPT2-H'!H65","v":""}]
[{"$f":"eSPAR!A65","v":0},{"$f":"eSPAR!B65","v":0},{"$f":"'pPT2-H'!C66","v":""},{"$f":"'pPT2-H'!D66","v":""},{"$f":"'pPT2-H'!E66","v":""},{"$f":"'pPT2-H'!F66","v":""},{"$f":"'pPT2-H'!G66","v":""},{"$f":"'pPT2-H'!H66","v":""}]
[{"$f":"eSPAR!A66","v":0},{"$f":"eSPAR!B66","v":0},{"$f":"'pPT2-H'!C67","v":""},{"$f":"'pPT2-H'!D67","v":""},{"$f":"'pPT2-H'!E67","v":""},{"$f":"'pPT2-H'!F67","v":""},{"$f":"'pPT2-H'!G67","v":""},{"$f":"'pPT2-H'!H67","v":""}]
[{"$f":"eSPAR!A67","v":0},{"$f":"eSPAR!B67","v":0},{"$f":"'pPT2-H'!C68","v":""},{"$f":"'pPT2-H'!D68","v":""},{"$f":"'pPT2-H'!E68","v":""},{"$f":"'pPT2-H'!F68","v":""},{"$f":"'pPT2-H'!G68","v":""},{"$f":"'pPT2-H'!H68","v":""}]
[{"$f":"eSPAR!A68","v":0},{"$f":"eSPAR!B68","v":0},{"$f":"'pPT2-H'!C69","v":""},{"$f":"'pPT2-H'!D69","v":""},{"$f":"'pPT2-H'!E69","v":""},{"$f":"'pPT2-H'!F69","v":""},{"$f":"'pPT2-H'!G69","v":""},{"$f":"'pPT2-H'!H69","v":""}]
[{"$f":"eSPAR!A69","v":0},{"$f":"eSPAR!B69","v":0},{"$f":"'pPT2-H'!C70","v":""},{"$f":"'pPT2-H'!D70","v":""},{"$f":"'pPT2-H'!E70","v":""},{"$f":"'pPT2-H'!F70","v":""},{"$f":"'pPT2-H'!G70","v":""},{"$f":"'pPT2-H'!H70","v":""}]
[{"$f":"eSPAR!A70","v":0},{"$f":"eSPAR!B70","v":0},{"$f":"'pPT2-H'!C71","v":""},{"$f":"'pPT2-H'!D71","v":""},{"$f":"'pPT2-H'!E71","v":""},{"$f":"'pPT2-H'!F71","v":""},{"$f":"'pPT2-H'!G71","v":""},{"$f":"'pPT2-H'!H71","v":""}]
[{"$f":"eSPAR!A71","v":0},{"$f":"eSPAR!B71","v":0},{"$f":"'pPT2-H'!C72","v":""},{"$f":"'pPT2-H'!D72","v":""},{"$f":"'pPT2-H'!E72","v":""},{"$f":"'pPT2-H'!F72","v":""},{"$f":"'pPT2-H'!G72","v":""},{"$f":"'pPT2-H'!H72","v":""}]
[{"$f":"eSPAR!A72","v":0},{"$f":"eSPAR!B72","v":0},{"$f":"'pPT2-H'!C73","v":""},{"$f":"'pPT2-H'!D73","v":""},{"$f":"'pPT2-H'!E73","v":""},{"$f":"'pPT2-H'!F73","v":""},{"$f":"'pPT2-H'!G73","v":""},{"$f":"'pPT2-H'!H73","v":""}]
[{"$f":"eSPAR!A73","v":0},{"$f":"eSPAR!B73","v":0},{"$f":"'pPT2-H'!C74","v":""},{"$f":"'pPT2-H'!D74","v":""},{"$f":"'pPT2-H'!E74","v":""},{"$f":"'pPT2-H'!F74","v":""},{"$f":"'pPT2-H'!G74","v":""},{"$f":"'pPT2-H'!H74","v":""}]
[{"$f":"eSPAR!A74","v":0},{"$f":"eSPAR!B74","v":0},{"$f":"'pPT2-H'!C75","v":""},{"$f":"'pPT2-H'!D75","v":""},{"$f":"'pPT2-H'!E75","v":""},{"$f":"'pPT2-H'!F75","v":""},{"$f":"'pPT2-H'!G75","v":""},{"$f":"'pPT2-H'!H75","v":""}]
[{"$f":"eSPAR!A75","v":0},{"$f":"eSPAR!B75","v":0},{"$f":"'pPT2-H'!C76","v":""},{"$f":"'pPT2-H'!D76","v":""},{"$f":"'pPT2-H'!E76","v":""},{"$f":"'pPT2-H'!F76","v":""},{"$f":"'pPT2-H'!G76","v":""},{"$f":"'pPT2-H'!H76","v":""}]
[{"$f":"eSPAR!A76","v":0},{"$f":"eSPAR!B76","v":0},{"$f":"'pPT2-H'!C77","v":""},{"$f":"'pPT2-H'!D77","v":""},{"$f":"'pPT2-H'!E77","v":""},{"$f":"'pPT2-H'!F77","v":""},{"$f":"'pPT2-H'!G77","v":""},{"$f":"'pPT2-H'!H77","v":""}]
[{"$f":"eSPAR!A77","v":0},{"$f":"eSPAR!B77","v":0},{"$f":"'pPT2-H'!C78","v":""},{"$f":"'pPT2-H'!D78","v":""},{"$f":"'pPT2-H'!E78","v":""},{"$f":"'pPT2-H'!F78","v":""},{"$f":"'pPT2-H'!G78","v":""},{"$f":"'pPT2-H'!H78","v":""}]
[{"$f":"eSPAR!A78","v":0},{"$f":"eSPAR!B78","v":0},{"$f":"'pPT2-H'!C79","v":""},{"$f":"'pPT2-H'!D79","v":""},{"$f":"'pPT2-H'!E79","v":""},{"$f":"'pPT2-H'!F79","v":""},{"$f":"'pPT2-H'!G79","v":""},{"$f":"'pPT2-H'!H79","v":""}]
[{"$f":"eSPAR!A79","v":0},{"$f":"eSPAR!B79","v":0},{"$f":"'pPT2-H'!C80","v":""},{"$f":"'pPT2-H'!D80","v":""},{"$f":"'pPT2-H'!E80","v":""},{"$f":"'pPT2-H'!F80","v":""},{"$f":"'pPT2-H'!G80","v":""},{"$f":"'pPT2-H'!H80","v":""}]
[{"$f":"eSPAR!A80","v":0},{"$f":"eSPAR!B80","v":0},{"$f":"'pPT2-H'!C81","v":""},{"$f":"'pPT2-H'!D81","v":""},{"$f":"'pPT2-H'!E81","v":""},{"$f":"'pPT2-H'!F81","v":""},{"$f":"'pPT2-H'!G81","v":""},{"$f":"'pPT2-H'!H81","v":""}]
[{"$f":"eSPAR!A81","v":0},{"$f":"eSPAR!B81","v":0},{"$f":"'pPT2-H'!C82","v":""},{"$f":"'pPT2-H'!D82","v":""},{"$f":"'pPT2-H'!E82","v":""},{"$f":"'pPT2-H'!F82","v":""},{"$f":"'pPT2-H'!G82","v":""},{"$f":"'pPT2-H'!H82","v":""}]
[{"$f":"eSPAR!A82","v":0},{"$f":"eSPAR!B82","v":0},{"$f":"'pPT2-H'!C83","v":""},{"$f":"'pPT2-H'!D83","v":""},{"$f":"'pPT2-H'!E83","v":""},{"$f":"'pPT2-H'!F83","v":""},{"$f":"'pPT2-H'!G83","v":""},{"$f":"'pPT2-H'!H83","v":""}]
[{"$f":"eSPAR!A83","v":0},{"$f":"eSPAR!B83","v":0},{"$f":"'pPT2-H'!C84","v":""},{"$f":"'pPT2-H'!D84","v":""},{"$f":"'pPT2-H'!E84","v":""},{"$f":"'pPT2-H'!F84","v":""},{"$f":"'pPT2-H'!G84","v":""},{"$f":"'pPT2-H'!H84","v":""}]
[{"$f":"eSPAR!A84","v":0},{"$f":"eSPAR!B84","v":0},{"$f":"'pPT2-H'!C85","v":""},{"$f":"'pPT2-H'!D85","v":""},{"$f":"'pPT2-H'!E85","v":""},{"$f":"'pPT2-H'!F85","v":""},{"$f":"'pPT2-H'!G85","v":""},{"$f":"'pPT2-H'!H85","v":""}]
[{"$f":"eSPAR!A85","v":0},{"$f":"eSPAR!B85","v":0},{"$f":"'pPT2-H'!C86","v":""},{"$f":"'pPT2-H'!D86","v":""},{"$f":"'pPT2-H'!E86","v":""},{"$f":"'pPT2-H'!F86","v":""},{"$f":"'pPT2-H'!G86","v":""},{"$f":"'pPT2-H'!H86","v":""}]

{"sheet":"pPT3","index":14,"n_rows":86,"n_cols":8,"rows_kept":86,"cut":false,"hidden":false,"merged":[[0,0,0,7],[1,0,1,7],[2,0,2,7],[3,0,5,0],[3,1,4,1],[3,2,4,2],[3,3,4,3],[3,4,4,4],[3,5,4,5],[3,6,4,6],[3,7,4,7]]}
[{"$f":"Internal!C25","v":"Golden Valley School"}]
[{"$f":"Internal!B34","v":"Class : IX"}]
[{"$f":"\"Periodic Test 3 (\"&Internal!B33&\")\"","v":"Periodic Test 3 (Academic Session: 2017-18)"}]
["Roll No.","Name",{"$f":"eSUBMAR!B6","v":"English"},{"$f":"eSUBMAR!B7","v":"Hindi"},{"$f":"eSUBMAR!B8","v":"Mathematics"},{"$f":"eSUBMAR!B9","v":"Science"},{"$f":"eSUBMAR!B10","v":"Social Studies"},{"$f":"eSUBMAR!B11","v":"I.T."}]
[]
[null,"Max. Marks>>",10,10,10,10,10,10]
[{"$f":"eSPAR!A6","v":1},{"$f":"eSPAR!B6","v":"Aman Kumar"},{"$f":"'pPT3-H'!C7","v":7},{"$f":"'pPT3-H'!D7","v":8},{"$f":"'pPT3-H'!E7","v":9},{"$f":"'pPT3-H'!F7","v":6},{"$f":"'pPT3-H'!G7","v":7},{"$f":"'pPT3-H'!H7","v":8}]
[{"$f":"eSPAR!A7","v":2},{"$f":"eSPAR!B7","v":0},{"$f":"'pPT3-H'!C8","v":0},{"$f":"'pPT3-H'!D8","v":0},{"$f":"'pPT3-H'!E8","v":0},{"$f":"'pPT3-H'!F8","v":0},{"$f":"'pPT3-H'!G8","v":0},{"$f":"'pPT3-H'!H8","v":0}]
[{"$f":"eSPAR!A8","v":0},{"$f":"eSPAR!B8","v":0},{"$f":"'pPT3-H'!C9","v":""},{"$f":"'pPT3-H'!D9","v":""},{"$f":"'pPT3-H'!E9","v":""},{"$f":"'pPT3-H'!F9","v":""},{"$f":"'pPT3-H'!G9","v":""},{"$f":"'pPT3-H'!H9","v":""}]
[{"$f":"eSPAR!A9","v":0},{"$f":"eSPAR!B9","v":0},{"$f":"'pPT3-H'!C10","v":""},{"$f":"'pPT3-H'!D10","v":""},{"$f":"'pPT3-H'!E10","v":""},{"$f":"'pPT3-H'!F10","v":""},{"$f":"'pPT3-H'!G10","v":""},{"$f":"'pPT3-H'!H10","v":""}]
[{"$f":"eSPAR!A10","v":0},{"$f":"eSPAR!B10","v":0},{"$f":"'pPT3-H'!C11","v":""},{"$f":"'pPT3-H'!D11","v":""},{"$f":"'pPT3-H'!E11","v":""},{"$f":"'pPT3-H'!F11","v":""},{"$f":"'pPT3-H'!G11","v":""},{"$f":"'pPT3-H'!H11","v":""}]
[{"$f":"eSPAR!A11","v":0},{"$f":"eSPAR!B11","v":0},{"$f":"'pPT3-H'!C12","v":""},{"$f":"'pPT3-H'!D12","v":""},{"$f":"'pPT3-H'!E12","v":""},{"$f":"'pPT3-H'!F12","v":""},{"$f":"'pPT3-H'!G12","v":""},{"$f":"'pPT3-H'!H12","v":""}]
[{"$f":"eSPAR!A12","v":0},{"$f":"eSPAR!B12","v":0},{"$f":"'pPT3-H'!C13","v":""},{"$f":"'pPT3-H'!D13","v":""},{"$f":"'pPT3-H'!E13","v":""},{"$f":"'pPT3-H'!F13","v":""},{"$f":"'pPT3-H'!G13","v":""},{"$f":"'pPT3-H'!H13","v":""}]
[{"$f":"eSPAR!A13","v":0},{"$f":"eSPAR!B13","v":0},{"$f":"'pPT3-H'!C14","v":""},{"$f":"'pPT3-H'!D14","v":""},{"$f":"'pPT3-H'!E14","v":""},{"$f":"'pPT3-H'!F14","v":""},{"$f":"'pPT3-H'!G14","v":""},{"$f":"'pPT3-H'!H14","v":""}]
[{"$f":"eSPAR!A14","v":0},{"$f":"eSPAR!B14","v":0},{"$f":"'pPT3-H'!C15","v":""},{"$f":"'pPT3-H'!D15","v":""},{"$f":"'pPT3-H'!E15","v":""},{"$f":"'pPT3-H'!F15","v":""},{"$f":"'pPT3-H'!G15","v":""},{"$f":"'pPT3-H'!H15","v":""}]
[{"$f":"eSPAR!A15","v":0},{"$f":"eSPAR!B15","v":0},{"$f":"'pPT3-H'!C16","v":""},{"$f":"'pPT3-H'!D16","v":""},{"$f":"'pPT3-H'!E16","v":""},{"$f":"'pPT3-H'!F16","v":""},{"$f":"'pPT3-H'!G16","v":""},{"$f":"'pPT3-H'!H16","v":""}]
[{"$f":"eSPAR!A16","v":0},{"$f":"eSPAR!B16","v":0},{"$f":"'pPT3-H'!C17","v":""},{"$f":"'pPT3-H'!D17","v":""},{"$f":"'pPT3-H'!E17","v":""},{"$f":"'pPT3-H'!F17","v":""},{"$f":"'pPT3-H'!G17","v":""},{"$f":"'pPT3-H'!H17","v":""}]
[{"$f":"eSPAR!A17","v":0},{"$f":"eSPAR!B17","v":0},{"$f":"'pPT3-H'!C18","v":""},{"$f":"'pPT3-H'!D18","v":""},{"$f":"'pPT3-H'!E18","v":""},{"$f":"'pPT3-H'!F18","v":""},{"$f":"'pPT3-H'!G18","v":""},{"$f":"'pPT3-H'!H18","v":""}]
[{"$f":"eSPAR!A18","v":0},{"$f":"eSPAR!B18","v":0},{"$f":"'pPT3-H'!C19","v":""},{"$f":"'pPT3-H'!D19","v":""},{"$f":"'pPT3-H'!E19","v":""},{"$f":"'pPT3-H'!F19","v":""},{"$f":"'pPT3-H'!G19","v":""},{"$f":"'pPT3-H'!H19","v":""}]
[{"$f":"eSPAR!A19","v":0},{"$f":"eSPAR!B19","v":0},{"$f":"'pPT3-H'!C20","v":""},{"$f":"'pPT3-H'!D20","v":""},{"$f":"'pPT3-H'!E20","v":""},{"$f":"'pPT3-H'!F20","v":""},{"$f":"'pPT3-H'!G20","v":""},{"$f":"'pPT3-H'!H20","v":""}]
[{"$f":"eSPAR!A20","v":0},{"$f":"eSPAR!B20","v":0},{"$f":"'pPT3-H'!C21","v":""},{"$f":"'pPT3-H'!D21","v":""},{"$f":"'pPT3-H'!E21","v":""},{"$f":"'pPT3-H'!F21","v":""},{"$f":"'pPT3-H'!G21","v":""},{"$f":"'pPT3-H'!H21","v":""}]
[{"$f":"eSPAR!A21","v":0},{"$f":"eSPAR!B21","v":0},{"$f":"'pPT3-H'!C22","v":""},{"$f":"'pPT3-H'!D22","v":""},{"$f":"'pPT3-H'!E22","v":""},{"$f":"'pPT3-H'!F22","v":""},{"$f":"'pPT3-H'!G22","v":""},{"$f":"'pPT3-H'!H22","v":""}]
[{"$f":"eSPAR!A22","v":0},{"$f":"eSPAR!B22","v":0},{"$f":"'pPT3-H'!C23","v":""},{"$f":"'pPT3-H'!D23","v":""},{"$f":"'pPT3-H'!E23","v":""},{"$f":"'pPT3-H'!F23","v":""},{"$f":"'pPT3-H'!G23","v":""},{"$f":"'pPT3-H'!H23","v":""}]
[{"$f":"eSPAR!A23","v":0},{"$f":"eSPAR!B23","v":0},{"$f":"'pPT3-H'!C24","v":""},{"$f":"'pPT3-H'!D24","v":""},{"$f":"'pPT3-H'!E24","v":""},{"$f":"'pPT3-H'!F24","v":""},{"$f":"'pPT3-H'!G24","v":""},{"$f":"'pPT3-H'!H24","v":""}]
[{"$f":"eSPAR!A24","v":0},{"$f":"eSPAR!B24","v":0},{"$f":"'pPT3-H'!C25","v":""},{"$f":"'pPT3-H'!D25","v":""},{"$f":"'pPT3-H'!E25","v":""},{"$f":"'pPT3-H'!F25","v":""},{"$f":"'pPT3-H'!G25","v":""},{"$f":"'pPT3-H'!H25","v":""}]
[{"$f":"eSPAR!A25","v":0},{"$f":"eSPAR!B25","v":0},{"$f":"'pPT3-H'!C26","v":""},{"$f":"'pPT3-H'!D26","v":""},{"$f":"'pPT3-H'!E26","v":""},{"$f":"'pPT3-H'!F26","v":""},{"$f":"'pPT3-H'!G26","v":""},{"$f":"'pPT3-H'!H26","v":""}]
[{"$f":"eSPAR!A26","v":0},{"$f":"eSPAR!B26","v":0},{"$f":"'pPT3-H'!C27","v":""},{"$f":"'pPT3-H'!D27","v":""},{"$f":"'pPT3-H'!E27","v":""},{"$f":"'pPT3-H'!F27","v":""},{"$f":"'pPT3-H'!G27","v":""},{"$f":"'pPT3-H'!H27","v":""}]
[{"$f":"eSPAR!A27","v":0},{"$f":"eSPAR!B27","v":0},{"$f":"'pPT3-H'!C28","v":""},{"$f":"'pPT3-H'!D28","v":""},{"$f":"'pPT3-H'!E28","v":""},{"$f":"'pPT3-H'!F28","v":""},{"$f":"'pPT3-H'!G28","v":""},{"$f":"'pPT3-H'!H28","v":""}]
[{"$f":"eSPAR!A28","v":0},{"$f":"eSPAR!B28","v":0},{"$f":"'pPT3-H'!C29","v":""},{"$f":"'pPT3-H'!D29","v":""},{"$f":"'pPT3-H'!E29","v":""},{"$f":"'pPT3-H'!F29","v":""},{"$f":"'pPT3-H'!G29","v":""},{"$f":"'pPT3-H'!H29","v":""}]
[{"$f":"eSPAR!A29","v":0},{"$f":"eSPAR!B29","v":0},{"$f":"'pPT3-H'!C30","v":""},{"$f":"'pPT3-H'!D30","v":""},{"$f":"'pPT3-H'!E30","v":""},{"$f":"'pPT3-H'!F30","v":""},{"$f":"'pPT3-H'!G30","v":""},{"$f":"'pPT3-H'!H30","v":""}]
[{"$f":"eSPAR!A30","v":0},{"$f":"eSPAR!B30","v":0},{"$f":"'pPT3-H'!C31","v":""},{"$f":"'pPT3-H'!D31","v":""},{"$f":"'pPT3-H'!E31","v":""},{"$f":"'pPT3-H'!F31","v":""},{"$f":"'pPT3-H'!G31","v":""},{"$f":"'pPT3-H'!H31","v":""}]
[{"$f":"eSPAR!A31","v":0},{"$f":"eSPAR!B31","v":0},{"$f":"'pPT3-H'!C32","v":""},{"$f":"'pPT3-H'!D32","v":""},{"$f":"'pPT3-H'!E32","v":""},{"$f":"'pPT3-H'!F32","v":""},{"$f":"'pPT3-H'!G32","v":""},{"$f":"'pPT3-H'!H32","v":""}]
[{"$f":"eSPAR!A32","v":0},{"$f":"eSPAR!B32","v":0},{"$f":"'pPT3-H'!C33","v":""},{"$f":"'pPT3-H'!D33","v":""},{"$f":"'pPT3-H'!E33","v":""},{"$f":"'pPT3-H'!F33","v":""},{"$f":"'pPT3-H'!G33","v":""},{"$f":"'pPT3-H'!H33","v":""}]
[{"$f":"eSPAR!A33","v":0},{"$f":"eSPAR!B33","v":0},{"$f":"'pPT3-H'!C34","v":""},{"$f":"'pPT3-H'!D34","v":""},{"$f":"'pPT3-H'!E34","v":""},{"$f":"'pPT3-H'!F34","v":""},{"$f":"'pPT3-H'!G34","v":""},{"$f":"'pPT3-H'!H34","v":""}]
[{"$f":"eSPAR!A34","v":0},{"$f":"eSPAR!B34","v":0},{"$f":"'pPT3-H'!C35","v":""},{"$f":"'pPT3-H'!D35","v":""},{"$f":"'pPT3-H'!E35","v":""},{"$f":"'pPT3-H'!F35","v":""},{"$f":"'pPT3-H'!G35","v":""},{"$f":"'pPT3-H'!H35","v":""}]
[{"$f":"eSPAR!A35","v":0},{"$f":"eSPAR!B35","v":0},{"$f":"'pPT3-H'!C36","v":""},{"$f":"'pPT3-H'!D36","v":""},{"$f":"'pPT3-H'!E36","v":""},{"$f":"'pPT3-H'!F36","v":""},{"$f":"'pPT3-H'!G36","v":""},{"$f":"'pPT3-H'!H36","v":""}]
[{"$f":"eSPAR!A36","v":0},{"$f":"eSPAR!B36","v":0},{"$f":"'pPT3-H'!C37","v":""},{"$f":"'pPT3-H'!D37","v":""},{"$f":"'pPT3-H'!E37","v":""},{"$f":"'pPT3-H'!F37","v":""},{"$f":"'pPT3-H'!G37","v":""},{"$f":"'pPT3-H'!H37","v":""}]
[{"$f":"eSPAR!A37","v":0},{"$f":"eSPAR!B37","v":0},{"$f":"'pPT3-H'!C38","v":""},{"$f":"'pPT3-H'!D38","v":""},{"$f":"'pPT3-H'!E38","v":""},{"$f":"'pPT3-H'!F38","v":""},{"$f":"'pPT3-H'!G38","v":""},{"$f":"'pPT3-H'!H38","v":""}]
[{"$f":"eSPAR!A38","v":0},{"$f":"eSPAR!B38","v":0},{"$f":"'pPT3-H'!C39","v":""},{"$f":"'pPT3-H'!D39","v":""},{"$f":"'pPT3-H'!E39","v":""},{"$f":"'pPT3-H'!F39","v":""},{"$f":"'pPT3-H'!G39","v":""},{"$f":"'pPT3-H'!H39","v":""}]
[{"$f":"eSPAR!A39","v":0},{"$f":"eSPAR!B39","v":0},{"$f":"'pPT3-H'!C40","v":""},{"$f":"'pPT3-H'!D40","v":""},{"$f":"'pPT3-H'!E40","v":""},{"$f":"'pPT3-H'!F40","v":""},{"$f":"'pPT3-H'!G40","v":""},{"$f":"'pPT3-H'!H40","v":""}]
[{"$f":"eSPAR!A40","v":0},{"$f":"eSPAR!B40","v":0},{"$f":"'pPT3-H'!C41","v":""},{"$f":"'pPT3-H'!D41","v":""},{"$f":"'pPT3-H'!E41","v":""},{"$f":"'pPT3-H'!F41","v":""},{"$f":"'pPT3-H'!G41","v":""},{"$f":"'pPT3-H'!H41","v":""}]
[{"$f":"eSPAR!A41","v":0},{"$f":"eSPAR!B41","v":0},{"$f":"'pPT3-H'!C42","v":""},{"$f":"'pPT3-H'!D42","v":""},{"$f":"'pPT3-H'!E42","v":""},{"$f":"'pPT3-H'!F42","v":""},{"$f":"'pPT3-H'!G42","v":""},{"$f":"'pPT3-H'!H42","v":""}]
[{"$f":"eSPAR!A42","v":0},{"$f":"eSPAR!B42","v":0},{"$f":"'pPT3-H'!C43","v":""},{"$f":"'pPT3-H'!D43","v":""},{"$f":"'pPT3-H'!E43","v":""},{"$f":"'pPT3-H'!F43","v":""},{"$f":"'pPT3-H'!G43","v":""},{"$f":"'pPT3-H'!H43","v":""}]
[{"$f":"eSPAR!A43","v":0},{"$f":"eSPAR!B43","v":0},{"$f":"'pPT3-H'!C44","v":""},{"$f":"'pPT3-H'!D44","v":""},{"$f":"'pPT3-H'!E44","v":""},{"$f":"'pPT3-H'!F44","v":""},{"$f":"'pPT3-H'!G44","v":""},{"$f":"'pPT3-H'!H44","v":""}]
[{"$f":"eSPAR!A44","v":0},{"$f":"eSPAR!B44","v":0},{"$f":"'pPT3-H'!C45","v":""},{"$f":"'pPT3-H'!D45","v":""},{"$f":"'pPT3-H'!E45","v":""},{"$f":"'pPT3-H'!F45","v":""},{"$f":"'pPT3-H'!G45","v":""},{"$f":"'pPT3-H'!H45","v":""}]
[{"$f":"eSPAR!A45","v":0},{"$f":"eSPAR!B45","v":0},{"$f":"'pPT3-H'!C46","v":""},{"$f":"'pPT3-H'!D46","v":""},{"$f":"'pPT3-H'!E46","v":""},{"$f":"'pPT3-H'!F46","v":""},{"$f":"'pPT3-H'!G46","v":""},{"$f":"'pPT3-H'!H46","v":""}]
[{"$f":"eSPAR!A46","v":0},{"$f":"eSPAR!B46","v":0},{"$f":"'pPT3-H'!C47","v":""},{"$f":"'pPT3-H'!D47","v":""},{"$f":"'pPT3-H'!E47","v":""},{"$f":"'pPT3-H'!F47","v":""},{"$f":"'pPT3-H'!G47","v":""},{"$f":"'pPT3-H'!H47","v":""}]
[{"$f":"eSPAR!A47","v":0},{"$f":"eSPAR!B47","v":0},{"$f":"'pPT3-H'!C48","v":""},{"$f":"'pPT3-H'!D48","v":""},{"$f":"'pPT3-H'!E48","v":""},{"$f":"'pPT3-H'!F48","v":""},{"$f":"'pPT3-H'!G48","v":""},{"$f":"'pPT3-H'!H48","v":""}]
[{"$f":"eSPAR!A48","v":0},{"$f":"eSPAR!B48","v":0},{"$f":"'pPT3-H'!C49","v":""},{"$f":"'pPT3-H'!D49","v":""},{"$f":"'pPT3-H'!E49","v":""},{"$f":"'pPT3-H'!F49","v":""},{"$f":"'pPT3-H'!G49","v":""},{"$f":"'pPT3-H'!H49","v":""}]
[{"$f":"eSPAR!A49","v":0},{"$f":"eSPAR!B49","v":0},{"$f":"'pPT3-H'!C50","v":""},{"$f":"'pPT3-H'!D50","v":""},{"$f":"'pPT3-H'!E50","v":""},{"$f":"'pPT3-H'!F50","v":""},{"$f":"'pPT3-H'!G50","v":""},{"$f":"'pPT3-H'!H50","v":""}]
[{"$f":"eSPAR!A50","v":0},{"$f":"eSPAR!B50","v":0},{"$f":"'pPT3-H'!C51","v":""},{"$f":"'pPT3-H'!D51","v":""},{"$f":"'pPT3-H'!E51","v":""},{"$f":"'pPT3-H'!F51","v":""},{"$f":"'pPT3-H'!G51","v":""},{"$f":"'pPT3-H'!H51","v":""}]
[{"$f":"eSPAR!A51","v":0},{"$f":"eSPAR!B51","v":0},{"$f":"'pPT3-H'!C52","v":""},{"$f":"'pPT3-H'!D52","v":""},{"$f":"'pPT3-H'!E52","v":""},{"$f":"'pPT3-H'!F52","v":""},{"$f":"'pPT3-H'!G52","v":""},{"$f":"'pPT3-H'!H52","v":""}]
[{"$f":"eSPAR!A52","v":0},{"$f":"eSPAR!B52","v":0},{"$f":"'pPT3-H'!C53","v":""},{"$f":"'pPT3-H'!D53","v":""},{"$f":"'pPT3-H'!E53","v":""},{"$f":"'pPT3-H'!F53","v":""},{"$f":"'pPT3-H'!G53","v":""},{"$f":"'pPT3-H'!H53","v":""}]
[{"$f":"eSPAR!A53","v":0},{"$f":"eSPAR!B53","v":0},{"$f":"'pPT3-H'!C54","v":""},{"$f":"'pPT3-H'!D54","v":""},{"$f":"'pPT3-H'!E54","v":""},{"$f":"'pPT3-H'!F54","v":""},{"$f":"'pPT3-H'!G54","v":""},{"$f":"'pPT3-H'!H54","v":""}]
[{"$f":"eSPAR!A54","v":0},{"$f":"eSPAR!B54","v":0},{"$f":"'pPT3-H'!C55","v":""},{"$f":"'pPT3-H'!D55","v":""},{"$f":"'pPT3-H'!E55","v":""},{"$f":"'pPT3-H'!F55","v":""},{"$f":"'pPT3-H'!G55","v":""},{"$f":"'pPT3-H'!H55","v":""}]
[{"$f":"eSPAR!A55","v":0},{"$f":"eSPAR!B55","v":0},{"$f":"'pPT3-H'!C56","v":""},{"$f":"'pPT3-H'!D56","v":""},{"$f":"'pPT3-H'!E56","v":""},{"$f":"'pPT3-H'!F56","v":""},{"$f":"'pPT3-H'!G56","v":""},{"$f":"'pPT3-H'!H56","v":""}]
[{"$f":"eSPAR!A56","v":0},{"$f":"eSPAR!B56","v":0},{"$f":"'pPT3-H'!C57","v":""},{"$f":"'pPT3-H'!D57","v":""},{"$f":"'pPT3-H'!E57","v":""},{"$f":"'pPT3-H'!F57","v":""},{"$f":"'pPT3-H'!G57","v":""},{"$f":"'pPT3-H'!H57","v":""}]
[{"$f":"eSPAR!A57","v":0},{"$f":"eSPAR!B57","v":0},{"$f":"'pPT3-H'!C58","v":""},{"$f":"'pPT3-H'!D58","v":""},{"$f":"'pPT3-H'!E58","v":""},{"$f":"'pPT3-H'!F58","v":""},{"$f":"'pPT3-H'!G58","v":""},{"$f":"'pPT3-H'!H58","v":""}]
[{"$f":"eSPAR!A58","v":0},{"$f":"eSPAR!B58","v":0},{"$f":"'pPT3-H'!C59","v":""},{"$f":"'pPT3-H'!D59","v":""},{"$f":"'pPT3-H'!E59","v":""},{"$f":"'pPT3-H'!F59","v":""},{"$f":"'pPT3-H'!G59","v":""},{"$f":"'pPT3-H'!H59","v":""}]
[{"$f":"eSPAR!A59","v":0},{"$f":"eSPAR!B59","v":0},{"$f":"'pPT3-H'!C60","v":""},{"$f":"'pPT3-H'!D60","v":""},{"$f":"'pPT3-H'!E60","v":""},{"$f":"'pPT3-H'!F60","v":""},{"$f":"'pPT3-H'!G60","v":""},{"$f":"'pPT3-H'!H60","v":""}]
[{"$f":"eSPAR!A60","v":0},{"$f":"eSPAR!B60","v":0},{"$f":"'pPT3-H'!C61","v":""},{"$f":"'pPT3-H'!D61","v":""},{"$f":"'pPT3-H'!E61","v":""},{"$f":"'pPT3-H'!F61","v":""},{"$f":"'pPT3-H'!G61","v":""},{"$f":"'pPT3-H'!H61","v":""}]
[{"$f":"eSPAR!A61","v":0},{"$f":"eSPAR!B61","v":0},{"$f":"'pPT3-H'!C62","v":""},{"$f":"'pPT3-H'!D62","v":""},{"$f":"'pPT3-H'!E62","v":""},{"$f":"'pPT3-H'!F62","v":""},{"$f":"'pPT3-H'!G62","v":""},{"$f":"'pPT3-H'!H62","v":""}]
[{"$f":"eSPAR!A62","v":0},{"$f":"eSPAR!B62","v":0},{"$f":"'pPT3-H'!C63","v":""},{"$f":"'pPT3-H'!D63","v":""},{"$f":"'pPT3-H'!E63","v":""},{"$f":"'pPT3-H'!F63","v":""},{"$f":"'pPT3-H'!G63","v":""},{"$f":"'pPT3-H'!H63","v":""}]
[{"$f":"eSPAR!A63","v":0},{"$f":"eSPAR!B63","v":0},{"$f":"'pPT3-H'!C64","v":""},{"$f":"'pPT3-H'!D64","v":""},{"$f":"'pPT3-H'!E64","v":""},{"$f":"'pPT3-H'!F64","v":""},{"$f":"'pPT3-H'!G64","v":""},{"$f":"'pPT3-H'!H64","v":""}]
[{"$f":"eSPAR!A64","v":0},{"$f":"eSPAR!B64","v":0},{"$f":"'pPT3-H'!C65","v":""},{"$f":"'pPT3-H'!D65","v":""},{"$f":"'pPT3-H'!E65","v":""},{"$f":"'pPT3-H'!F65","v":""},{"$f":"'pPT3-H'!G65","v":""},{"$f":"'pPT3-H'!H65","v":""}]
[{"$f":"eSPAR!A65","v":0},{"$f":"eSPAR!B65","v":0},{"$f":"'pPT3-H'!C66","v":""},{"$f":"'pPT3-H'!D66","v":""},{"$f":"'pPT3-H'!E66","v":""},{"$f":"'pPT3-H'!F66","v":""},{"$f":"'pPT3-H'!G66","v":""},{"$f":"'pPT3-H'!H66","v":""}]
[{"$f":"eSPAR!A66","v":0},{"$f":"eSPAR!B66","v":0},{"$f":"'pPT3-H'!C67","v":""},{"$f":"'pPT3-H'!D67","v":""},{"$f":"'pPT3-H'!E67","v":""},{"$f":"'pPT3-H'!F67","v":""},{"$f":"'pPT3-H'!G67","v":""},{"$f":"'pPT3-H'!H67","v":""}]
[{"$f":"eSPAR!A67","v":0},{"$f":"eSPAR!B67","v":0},{"$f":"'pPT3-H'!C68","v":""},{"$f":"'pPT3-H'!D68","v":""},{"$f":"'pPT3-H'!E68","v":""},{"$f":"'pPT3-H'!F68","v":""},{"$f":"'pPT3-H'!G68","v":""},{"$f":"'pPT3-H'!H68","v":""}]
[{"$f":"eSPAR!A68","v":0},{"$f":"eSPAR!B68","v":0},{"$f":"'pPT3-H'!C69","v":""},{"$f":"'pPT3-H'!D69","v":""},{"$f":"'pPT3-H'!E69","v":""},{"$f":"'pPT3-H'!F69","v":""},{"$f":"'pPT3-H'!G69","v":""},{"$f":"'pPT3-H'!H69","v":""}]
[{"$f":"eSPAR!A69","v":0},{"$f":"eSPAR!B69","v":0},{"$f":"'pPT3-H'!C70","v":""},{"$f":"'pPT3-H'!D70","v":""},{"$f":"'pPT3-H'!E70","v":""},{"$f":"'pPT3-H'!F70","v":""},{"$f":"'pPT3-H'!G70","v":""},{"$f":"'pPT3-H'!H70","v":""}]
[{"$f":"eSPAR!A70","v":0},{"$f":"eSPAR!B70","v":0},{"$f":"'pPT3-H'!C71","v":""},{"$f":"'pPT3-H'!D71","v":""},{"$f":"'pPT3-H'!E71","v":""},{"$f":"'pPT3-H'!F71","v":""},{"$f":"'pPT3-H'!G71","v":""},{"$f":"'pPT3-H'!H71","v":""}]
[{"$f":"eSPAR!A71","v":0},{"$f":"eSPAR!B71","v":0},{"$f":"'pPT3-H'!C72","v":""},{"$f":"'pPT3-H'!D72","v":""},{"$f":"'pPT3-H'!E72","v":""},{"$f":"'pPT3-H'!F72","v":""},{"$f":"'pPT3-H'!G72","v":""},{"$f":"'pPT3-H'!H72","v":""}]
[{"$f":"eSPAR!A72","v":0},{"$f":"eSPAR!B72","v":0},{"$f":"'pPT3-H'!C73","v":""},{"$f":"'pPT3-H'!D73","v":""},{"$f":"'pPT3-H'!E73","v":""},{"$f":"'pPT3-H'!F73","v":""},{"$f":"'pPT3-H'!G73","v":""},{"$f":"'pPT3-H'!H73","v":""}]
[{"$f":"eSPAR!A73","v":0},{"$f":"eSPAR!B73","v":0},{"$f":"'pPT3-H'!C74","v":""},{"$f":"'pPT3-H'!D74","v":""},{"$f":"'pPT3-H'!E74","v":""},{"$f":"'pPT3-H'!F74","v":""},{"$f":"'pPT3-H'!G74","v":""},{"$f":"'pPT3-H'!H74","v":""}]
[{"$f":"eSPAR!A74","v":0},{"$f":"eSPAR!B74","v":0},{"$f":"'pPT3-H'!C75","v":""},{"$f":"'pPT3-H'!D75","v":""},{"$f":"'pPT3-H'!E75","v":""},{"$f":"'pPT3-H'!F75","v":""},{"$f":"'pPT3-H'!G75","v":""},{"$f":"'pPT3-H'!H75","v":""}]
[{"$f":"eSPAR!A75","v":0},{"$f":"eSPAR!B75","v":0},{"$f":"'pPT3-H'!C76","v":""},{"$f":"'pPT3-H'!D76","v":""},{"$f":"'pPT3-H'!E76","v":""},{"$f":"'pPT3-H'!F76","v":""},{"$f":"'pPT3-H'!G76","v":""},{"$f":"'pPT3-H'!H76","v":""}]
[{"$f":"eSPAR!A76","v":0},{"$f":"eSPAR!B76","v":0},{"$f":"'pPT3-H'!C77","v":""},{"$f":"'pPT3-H'!D77","v":""},{"$f":"'pPT3-H'!E77","v":""},{"$f":"'pPT3-H'!F77","v":""},{"$f":"'pPT3-H'!G77","v":""},{"$f":"'pPT3-H'!H77","v":""}]
[{"$f":"eSPAR!A77","v":0},{"$f":"eSPAR!B77","v":0},{"$f":"'pPT3-H'!C78","v":""},{"$f":"'pPT3-H'!D78","v":""},{"$f":"'pPT3-H'!E78","v":""},{"$f":"'pPT3-H'!F78","v":""},{"$f":"'pPT3-H'!G78","v":""},{"$f":"'pPT3-H'!H78","v":""}]
[{"$f":"eSPAR!A78","v":0},{"$f":"eSPAR!B78","v":0},{"$f":"'pPT3-H'!C79","v":""},{"$f":"'pPT3-H'!D79","v":""},{"$f":"'pPT3-H'!E79","v":""},{"$f":"'pPT3-H'!F79","v":""},{"$f":"'pPT3-H'!G79","v":""},{"$f":"'pPT3-H'!H79","v":""}]
[{"$f":"eSPAR!A79","v":0},{"$f":"eSPAR!B79","v":0},{"$f":"'pPT3-H'!C80","v":""},{"$f":"'pPT3-H'!D80","v":""},{"$f":"'pPT3-H'!E80","v":""},{"$f":"'pPT3-H'!F80","v":""},{"$f":"'pPT3-H'!G80","v":""},{"$f":"'pPT3-H'!H80","v":""}]
[{"$f":"eSPAR!A80","v":0},{"$f":"eSPAR!B80","v":0},{"$f":"'pPT3-H'!C81","v":""},{"$f":"'pPT3-H'!D81","v":""},{"$f":"'pPT3-H'!E81","v":""},{"$f":"'pPT3-H'!F81","v":""},{"$f":"'pPT3-H'!G81","v":""},{"$f":"'pPT3-H'!H81","v":""}]
[{"$f":"eSPAR!A81","v":0},{"$f":"eSPAR!B81","v":0},{"$f":"'pPT3-H'!C82","v":""},{"$f":"'pPT3-H'!D82","v":""},{"$f":"'pPT3-H'!E82","v":""},{"$f":"'pPT3-H'!F82","v":""},{"$f":"'pPT3-H'!G82","v":""},{"$f":"'pPT3-H'!H82","v":""}]
[{"$f":"eSPAR!A82","v":0},{"$f":"eSPAR!B82","v":0},{"$f":"'pPT3-H'!C83","v":""},{"$f":"'pPT3-H'!D83","v":""},{"$f":"'pPT3-H'!E83","v":""},{"$f":"'pPT3-H'!F83","v":""},{"$f":"'pPT3-H'!G83","v":""},{"$f":"'pPT3-H'!H83","v":""}]
[{"$f":"eSPAR!A83","v":0},{"$f":"eSPAR!B83","v":0},{"$f":"'pPT3-H'!C84","v":""},{"$f":"'pPT3-H'!D84","v":""},{"$f":"'pPT3-H'!E84","v":""},{"$f":"'pPT3-H'!F84","v":""},{"$f":"'pPT3-H'!G84","v":""},{"$f":"'pPT3-H'!H84","v":""}]
[{"$f":"eSPAR!A84","v":0},{"$f":"eSPAR!B84","v":0},{"$f":"'pPT3-H'!C85","v":""},{"$f":"'pPT3-H'!D85","v":""},{"$f":"'pPT3-H'!E85","v":""},{"$f":"'pPT3-H'!F85","v":""},{"$f":"'pPT3-H'!G85","v":""},{"$f":"'pPT3-H'!H85","v":""}]
[{"$f":"eSPAR!A85","v":0},{"$f":"eSPAR!B85","v":0},{"$f":"'pPT3-H'!C86","v":""},{"$f":"'pPT3-H'!D86","v":""},{"$f":"'pPT3-H'!E86","v":""},{"$f":"'pPT3-H'!F86","v":""},{"$f":"'pPT3-H'!G86","v":""},{"$f":"'pPT3-H'!H86","v":""}]

{"sheet":"pPT1-H","index":15,"n_rows":86,"n_cols":8,"rows_kept":86,"cut":false,"hidden":true,"merged":[[3,7,4,7],[0,0,0,7],[1,0,1,7],[2,0,2,7],[3,0,5,0],[3,1,4,1],[3,2,4,2],[3,3,4,3],[3,4,4,4],[3,5,4,5],[3,6,4,6]]}
[{"$f":"Internal!C25","v":"Golden Valley School"}]
[{"$f":"Internal!B34","v":"Class : IX"}]
[{"$f":"\"Periodic Test 1 (\"&Internal!B33&\")\"","v":"Periodic Test 1 (Academic Session: 2017-18)"}]
["Roll No.","Name",{"$f":"eSUBMAR!B6","v":"English"},{"$f":"eSUBMAR!B7","v":"Hindi"},{"$f":"eSUBMAR!B8","v":"Mathematics"},{"$f":"eSUBMAR!B9","v":"Science"},{"$f":"eSUBMAR!B10","v":"Social Studies"},{"$f":"eSUBMAR!B11","v":"I.T."}]
[]
[null,"Max. Marks>>",10,10,10,10,10,10]
[{"$f":"eSPAR!A6","v":1},{"$f":"eSPAR!B6","v":"Aman Kumar"},{"$f":"IF(eSPAR!A6=\"\",\"\",PERCENTAGE2!C7)","v":7},{"$f":"IF(eSPAR!A6=\"\",\"\",PERCENTAGE2!D7)","v":6},{"$f":"IF(eSPAR!A6=\"\",\"\",PERCENTAGE2!E7)","v":7},{"$f":"IF(eSPAR!A6=\"\",\"\",PERCENTAGE2!F7)","v":8},{"$f":"IF(eSPAR!A6=\"\",\"\",PERCENTAGE2!G7)","v":8},{"$f":"IF(eSPAR!A6=\"\",\"\",PERCENTAGE2!H7)","v":5}]
[{"$f":"eSPAR!A7","v":2},{"$f":"eSPAR!B7","v":0},{"$f":"IF(eSPAR!A7=\"\",\"\",PERCENTAGE2!C8)","v":0},{"$f":"IF(eSPAR!A7=\"\",\"\",PERCENTAGE2!D8)","v":0},{"$f":"IF(eSPAR!A7=\"\",\"\",PERCENTAGE2!E8)","v":0},{"$f":"IF(eSPAR!A7=\"\",\"\",PERCENTAGE2!F8)","v":0},{"$f":"IF(eSPAR!A7=\"\",\"\",PERCENTAGE2!G8)","v":0},{"$f":"IF(eSPAR!A7=\"\",\"\",PERCENTAGE2!H8)","v":0}]
[{"$f":"eSPAR!A8","v":0},{"$f":"eSPAR!B8","v":0},{"$f":"IF(eSPAR!A8=\"\",\"\",PERCENTAGE2!C9)","v":""},{"$f":"IF(eSPAR!A8=\"\",\"\",PERCENTAGE2!D9)","v":""},{"$f":"IF(eSPAR!A8=\"\",\"\",PERCENTAGE2!E9)","v":""},{"$f":"IF(eSPAR!A8=\"\",\"\",PERCENTAGE2!F9)","v":""},{"$f":"IF(eSPAR!A8=\"\",\"\",PERCENTAGE2!G9)","v":""},{"$f":"IF(eSPAR!A8=\"\",\"\",PERCENTAGE2!H9)","v":""}]
[{"$f":"eSPAR!A9","v":0},{"$f":"eSPAR!B9","v":0},{"$f":"IF(eSPAR!A9=\"\",\"\",PERCENTAGE2!C10)","v":""},{"$f":"IF(eSPAR!A9=\"\",\"\",PERCENTAGE2!D10)","v":""},{"$f":"IF(eSPAR!A9=\"\",\"\",PERCENTAGE2!E10)","v":""},{"$f":"IF(eSPAR!A9=\"\",\"\",PERCENTAGE2!F10)","v":""},{"$f":"IF(eSPAR!A9=\"\",\"\",PERCENTAGE2!G10)","v":""},{"$f":"IF(eSPAR!A9=\"\",\"\",PERCENTAGE2!H10)","v":""}]
[{"$f":"eSPAR!A10","v":0},{"$f":"eSPAR!B10","v":0},{"$f":"IF(eSPAR!A10=\"\",\"\",PERCENTAGE2!C11)","v":""},{"$f":"IF(eSPAR!A10=\"\",\"\",PERCENTAGE2!D11)","v":""},{"$f":"IF(eSPAR!A10=\"\",\"\",PERCENTAGE2!E11)","v":""},{"$f":"IF(eSPAR!A10=\"\",\"\",PERCENTAGE2!F11)","v":""},{"$f":"IF(eSPAR!A10=\"\",\"\",PERCENTAGE2!G11)","v":""},{"$f":"IF(eSPAR!A10=\"\",\"\",PERCENTAGE2!H11)","v":""}]
[{"$f":"eSPAR!A11","v":0},{"$f":"eSPAR!B11","v":0},{"$f":"IF(eSPAR!A11=\"\",\"\",PERCENTAGE2!C12)","v":""},{"$f":"IF(eSPAR!A11=\"\",\"\",PERCENTAGE2!D12)","v":""},{"$f":"IF(eSPAR!A11=\"\",\"\",PERCENTAGE2!E12)","v":""},{"$f":"IF(eSPAR!A11=\"\",\"\",PERCENTAGE2!F12)","v":""},{"$f":"IF(eSPAR!A11=\"\",\"\",PERCENTAGE2!G12)","v":""},{"$f":"IF(eSPAR!A11=\"\",\"\",PERCENTAGE2!H12)","v":""}]
[{"$f":"eSPAR!A12","v":0},{"$f":"eSPAR!B12","v":0},{"$f":"IF(eSPAR!A12=\"\",\"\",PERCENTAGE2!C13)","v":""},{"$f":"IF(eSPAR!A12=\"\",\"\",PERCENTAGE2!D13)","v":""},{"$f":"IF(eSPAR!A12=\"\",\"\",PERCENTAGE2!E13)","v":""},{"$f":"IF(eSPAR!A12=\"\",\"\",PERCENTAGE2!F13)","v":""},{"$f":"IF(eSPAR!A12=\"\",\"\",PERCENTAGE2!G13)","v":""},{"$f":"IF(eSPAR!A12=\"\",\"\",PERCENTAGE2!H13)","v":""}]
[{"$f":"eSPAR!A13","v":0},{"$f":"eSPAR!B13","v":0},{"$f":"IF(eSPAR!A13=\"\",\"\",PERCENTAGE2!C14)","v":""},{"$f":"IF(eSPAR!A13=\"\",\"\",PERCENTAGE2!D14)","v":""},{"$f":"IF(eSPAR!A13=\"\",\"\",PERCENTAGE2!E14)","v":""},{"$f":"IF(eSPAR!A13=\"\",\"\",PERCENTAGE2!F14)","v":""},{"$f":"IF(eSPAR!A13=\"\",\"\",PERCENTAGE2!G14)","v":""},{"$f":"IF(eSPAR!A13=\"\",\"\",PERCENTAGE2!H14)","v":""}]
[{"$f":"eSPAR!A14","v":0},{"$f":"eSPAR!B14","v":0},{"$f":"IF(eSPAR!A14=\"\",\"\",PERCENTAGE2!C15)","v":""},{"$f":"IF(eSPAR!A14=\"\",\"\",PERCENTAGE2!D15)","v":""},{"$f":"IF(eSPAR!A14=\"\",\"\",PERCENTAGE2!E15)","v":""},{"$f":"IF(eSPAR!A14=\"\",\"\",PERCENTAGE2!F15)","v":""},{"$f":"IF(eSPAR!A14=\"\",\"\",PERCENTAGE2!G15)","v":""},{"$f":"IF(eSPAR!A14=\"\",\"\",PERCENTAGE2!H15)","v":""}]
[{"$f":"eSPAR!A15","v":0},{"$f":"eSPAR!B15","v":0},{"$f":"IF(eSPAR!A15=\"\",\"\",PERCENTAGE2!C16)","v":""},{"$f":"IF(eSPAR!A15=\"\",\"\",PERCENTAGE2!D16)","v":""},{"$f":"IF(eSPAR!A15=\"\",\"\",PERCENTAGE2!E16)","v":""},{"$f":"IF(eSPAR!A15=\"\",\"\",PERCENTAGE2!F16)","v":""},{"$f":"IF(eSPAR!A15=\"\",\"\",PERCENTAGE2!G16)","v":""},{"$f":"IF(eSPAR!A15=\"\",\"\",PERCENTAGE2!H16)","v":""}]
[{"$f":"eSPAR!A16","v":0},{"$f":"eSPAR!B16","v":0},{"$f":"IF(eSPAR!A16=\"\",\"\",PERCENTAGE2!C17)","v":""},{"$f":"IF(eSPAR!A16=\"\",\"\",PERCENTAGE2!D17)","v":""},{"$f":"IF(eSPAR!A16=\"\",\"\",PERCENTAGE2!E17)","v":""},{"$f":"IF(eSPAR!A16=\"\",\"\",PERCENTAGE2!F17)","v":""},{"$f":"IF(eSPAR!A16=\"\",\"\",PERCENTAGE2!G17)","v":""},{"$f":"IF(eSPAR!A16=\"\",\"\",PERCENTAGE2!H17)","v":""}]
[{"$f":"eSPAR!A17","v":0},{"$f":"eSPAR!B17","v":0},{"$f":"IF(eSPAR!A17=\"\",\"\",PERCENTAGE2!C18)","v":""},{"$f":"IF(eSPAR!A17=\"\",\"\",PERCENTAGE2!D18)","v":""},{"$f":"IF(eSPAR!A17=\"\",\"\",PERCENTAGE2!E18)","v":""},{"$f":"IF(eSPAR!A17=\"\",\"\",PERCENTAGE2!F18)","v":""},{"$f":"IF(eSPAR!A17=\"\",\"\",PERCENTAGE2!G18)","v":""},{"$f":"IF(eSPAR!A17=\"\",\"\",PERCENTAGE2!H18)","v":""}]
[{"$f":"eSPAR!A18","v":0},{"$f":"eSPAR!B18","v":0},{"$f":"IF(eSPAR!A18=\"\",\"\",PERCENTAGE2!C19)","v":""},{"$f":"IF(eSPAR!A18=\"\",\"\",PERCENTAGE2!D19)","v":""},{"$f":"IF(eSPAR!A18=\"\",\"\",PERCENTAGE2!E19)","v":""},{"$f":"IF(eSPAR!A18=\"\",\"\",PERCENTAGE2!F19)","v":""},{"$f":"IF(eSPAR!A18=\"\",\"\",PERCENTAGE2!G19)","v":""},{"$f":"IF(eSPAR!A18=\"\",\"\",PERCENTAGE2!H19)","v":""}]
[{"$f":"eSPAR!A19","v":0},{"$f":"eSPAR!B19","v":0},{"$f":"IF(eSPAR!A19=\"\",\"\",PERCENTAGE2!C20)","v":""},{"$f":"IF(eSPAR!A19=\"\",\"\",PERCENTAGE2!D20)","v":""},{"$f":"IF(eSPAR!A19=\"\",\"\",PERCENTAGE2!E20)","v":""},{"$f":"IF(eSPAR!A19=\"\",\"\",PERCENTAGE2!F20)","v":""},{"$f":"IF(eSPAR!A19=\"\",\"\",PERCENTAGE2!G20)","v":""},{"$f":"IF(eSPAR!A19=\"\",\"\",PERCENTAGE2!H20)","v":""}]
[{"$f":"eSPAR!A20","v":0},{"$f":"eSPAR!B20","v":0},{"$f":"IF(eSPAR!A20=\"\",\"\",PERCENTAGE2!C21)","v":""},{"$f":"IF(eSPAR!A20=\"\",\"\",PERCENTAGE2!D21)","v":""},{"$f":"IF(eSPAR!A20=\"\",\"\",PERCENTAGE2!E21)","v":""},{"$f":"IF(eSPAR!A20=\"\",\"\",PERCENTAGE2!F21)","v":""},{"$f":"IF(eSPAR!A20=\"\",\"\",PERCENTAGE2!G21)","v":""},{"$f":"IF(eSPAR!A20=\"\",\"\",PERCENTAGE2!H21)","v":""}]
[{"$f":"eSPAR!A21","v":0},{"$f":"eSPAR!B21","v":0},{"$f":"IF(eSPAR!A21=\"\",\"\",PERCENTAGE2!C22)","v":""},{"$f":"IF(eSPAR!A21=\"\",\"\",PERCENTAGE2!D22)","v":""},{"$f":"IF(eSPAR!A21=\"\",\"\",PERCENTAGE2!E22)","v":""},{"$f":"IF(eSPAR!A21=\"\",\"\",PERCENTAGE2!F22)","v":""},{"$f":"IF(eSPAR!A21=\"\",\"\",PERCENTAGE2!G22)","v":""},{"$f":"IF(eSPAR!A21=\"\",\"\",PERCENTAGE2!H22)","v":""}]
[{"$f":"eSPAR!A22","v":0},{"$f":"eSPAR!B22","v":0},{"$f":"IF(eSPAR!A22=\"\",\"\",PERCENTAGE2!C23)","v":""},{"$f":"IF(eSPAR!A22=\"\",\"\",PERCENTAGE2!D23)","v":""},{"$f":"IF(eSPAR!A22=\"\",\"\",PERCENTAGE2!E23)","v":""},{"$f":"IF(eSPAR!A22=\"\",\"\",PERCENTAGE2!F23)","v":""},{"$f":"IF(eSPAR!A22=\"\",\"\",PERCENTAGE2!G23)","v":""},{"$f":"IF(eSPAR!A22=\"\",\"\",PERCENTAGE2!H23)","v":""}]
[{"$f":"eSPAR!A23","v":0},{"$f":"eSPAR!B23","v":0},{"$f":"IF(eSPAR!A23=\"\",\"\",PERCENTAGE2!C24)","v":""},{"$f":"IF(eSPAR!A23=\"\",\"\",PERCENTAGE2!D24)","v":""},{"$f":"IF(eSPAR!A23=\"\",\"\",PERCENTAGE2!E24)","v":""},{"$f":"IF(eSPAR!A23=\"\",\"\",PERCENTAGE2!F24)","v":""},{"$f":"IF(eSPAR!A23=\"\",\"\",PERCENTAGE2!G24)","v":""},{"$f":"IF(eSPAR!A23=\"\",\"\",PERCENTAGE2!H24)","v":""}]
[{"$f":"eSPAR!A24","v":0},{"$f":"eSPAR!B24","v":0},{"$f":"IF(eSPAR!A24=\"\",\"\",PERCENTAGE2!C25)","v":""},{"$f":"IF(eSPAR!A24=\"\",\"\",PERCENTAGE2!D25)","v":""},{"$f":"IF(eSPAR!A24=\"\",\"\",PERCENTAGE2!E25)","v":""},{"$f":"IF(eSPAR!A24=\"\",\"\",PERCENTAGE2!F25)","v":""},{"$f":"IF(eSPAR!A24=\"\",\"\",PERCENTAGE2!G25)","v":""},{"$f":"IF(eSPAR!A24=\"\",\"\",PERCENTAGE2!H25)","v":""}]
[{"$f":"eSPAR!A25","v":0},{"$f":"eSPAR!B25","v":0},{"$f":"IF(eSPAR!A25=\"\",\"\",PERCENTAGE2!C26)","v":""},{"$f":"IF(eSPAR!A25=\"\",\"\",PERCENTAGE2!D26)","v":""},{"$f":"IF(eSPAR!A25=\"\",\"\",PERCENTAGE2!E26)","v":""},{"$f":"IF(eSPAR!A25=\"\",\"\",PERCENTAGE2!F26)","v":""},{"$f":"IF(eSPAR!A25=\"\",\"\",PERCENTAGE2!G26)","v":""},{"$f":"IF(eSPAR!A25=\"\",\"\",PERCENTAGE2!H26)","v":""}]
[{"$f":"eSPAR!A26","v":0},{"$f":"eSPAR!B26","v":0},{"$f":"IF(eSPAR!A26=\"\",\"\",PERCENTAGE2!C27)","v":""},{"$f":"IF(eSPAR!A26=\"\",\"\",PERCENTAGE2!D27)","v":""},{"$f":"IF(eSPAR!A26=\"\",\"\",PERCENTAGE2!E27)","v":""},{"$f":"IF(eSPAR!A26=\"\",\"\",PERCENTAGE2!F27)","v":""},{"$f":"IF(eSPAR!A26=\"\",\"\",PERCENTAGE2!G27)","v":""},{"$f":"IF(eSPAR!A26=\"\",\"\",PERCENTAGE2!H27)","v":""}]
[{"$f":"eSPAR!A27","v":0},{"$f":"eSPAR!B27","v":0},{"$f":"IF(eSPAR!A27=\"\",\"\",PERCENTAGE2!C28)","v":""},{"$f":"IF(eSPAR!A27=\"\",\"\",PERCENTAGE2!D28)","v":""},{"$f":"IF(eSPAR!A27=\"\",\"\",PERCENTAGE2!E28)","v":""},{"$f":"IF(eSPAR!A27=\"\",\"\",PERCENTAGE2!F28)","v":""},{"$f":"IF(eSPAR!A27=\"\",\"\",PERCENTAGE2!G28)","v":""},{"$f":"IF(eSPAR!A27=\"\",\"\",PERCENTAGE2!H28)","v":""}]
[{"$f":"eSPAR!A28","v":0},{"$f":"eSPAR!B28","v":0},{"$f":"IF(eSPAR!A28=\"\",\"\",PERCENTAGE2!C29)","v":""},{"$f":"IF(eSPAR!A28=\"\",\"\",PERCENTAGE2!D29)","v":""},{"$f":"IF(eSPAR!A28=\"\",\"\",PERCENTAGE2!E29)","v":""},{"$f":"IF(eSPAR!A28=\"\",\"\",PERCENTAGE2!F29)","v":""},{"$f":"IF(eSPAR!A28=\"\",\"\",PERCENTAGE2!G29)","v":""},{"$f":"IF(eSPAR!A28=\"\",\"\",PERCENTAGE2!H29)","v":""}]
[{"$f":"eSPAR!A29","v":0},{"$f":"eSPAR!B29","v":0},{"$f":"IF(eSPAR!A29=\"\",\"\",PERCENTAGE2!C30)","v":""},{"$f":"IF(eSPAR!A29=\"\",\"\",PERCENTAGE2!D30)","v":""},{"$f":"IF(eSPAR!A29=\"\",\"\",PERCENTAGE2!E30)","v":""},{"$f":"IF(eSPAR!A29=\"\",\"\",PERCENTAGE2!F30)","v":""},{"$f":"IF(eSPAR!A29=\"\",\"\",PERCENTAGE2!G30)","v":""},{"$f":"IF(eSPAR!A29=\"\",\"\",PERCENTAGE2!H30)","v":""}]
[{"$f":"eSPAR!A30","v":0},{"$f":"eSPAR!B30","v":0},{"$f":"IF(eSPAR!A30=\"\",\"\",PERCENTAGE2!C31)","v":""},{"$f":"IF(eSPAR!A30=\"\",\"\",PERCENTAGE2!D31)","v":""},{"$f":"IF(eSPAR!A30=\"\",\"\",PERCENTAGE2!E31)","v":""},{"$f":"IF(eSPAR!A30=\"\",\"\",PERCENTAGE2!F31)","v":""},{"$f":"IF(eSPAR!A30=\"\",\"\",PERCENTAGE2!G31)","v":""},{"$f":"IF(eSPAR!A30=\"\",\"\",PERCENTAGE2!H31)","v":""}]
[{"$f":"eSPAR!A31","v":0},{"$f":"eSPAR!B31","v":0},{"$f":"IF(eSPAR!A31=\"\",\"\",PERCENTAGE2!C32)","v":""},{"$f":"IF(eSPAR!A31=\"\",\"\",PERCENTAGE2!D32)","v":""},{"$f":"IF(eSPAR!A31=\"\",\"\",PERCENTAGE2!E32)","v":""},{"$f":"IF(eSPAR!A31=\"\",\"\",PERCENTAGE2!F32)","v":""},{"$f":"IF(eSPAR!A31=\"\",\"\",PERCENTAGE2!G32)","v":""},{"$f":"IF(eSPAR!A31=\"\",\"\",PERCENTAGE2!H32)","v":""}]
[{"$f":"eSPAR!A32","v":0},{"$f":"eSPAR!B32","v":0},{"$f":"IF(eSPAR!A32=\"\",\"\",PERCENTAGE2!C33)","v":""},{"$f":"IF(eSPAR!A32=\"\",\"\",PERCENTAGE2!D33)","v":""},{"$f":"IF(eSPAR!A32=\"\",\"\",PERCENTAGE2!E33)","v":""},{"$f":"IF(eSPAR!A32=\"\",\"\",PERCENTAGE2!F33)","v":""},{"$f":"IF(eSPAR!A32=\"\",\"\",PERCENTAGE2!G33)","v":""},{"$f":"IF(eSPAR!A32=\"\",\"\",PERCENTAGE2!H33)","v":""}]
[{"$f":"eSPAR!A33","v":0},{"$f":"eSPAR!B33","v":0},{"$f":"IF(eSPAR!A33=\"\",\"\",PERCENTAGE2!C34)","v":""},{"$f":"IF(eSPAR!A33=\"\",\"\",PERCENTAGE2!D34)","v":""},{"$f":"IF(eSPAR!A33=\"\",\"\",PERCENTAGE2!E34)","v":""},{"$f":"IF(eSPAR!A33=\"\",\"\",PERCENTAGE2!F34)","v":""},{"$f":"IF(eSPAR!A33=\"\",\"\",PERCENTAGE2!G34)","v":""},{"$f":"IF(eSPAR!A33=\"\",\"\",PERCENTAGE2!H34)","v":""}]
[{"$f":"eSPAR!A34","v":0},{"$f":"eSPAR!B34","v":0},{"$f":"IF(eSPAR!A34=\"\",\"\",PERCENTAGE2!C35)","v":""},{"$f":"IF(eSPAR!A34=\"\",\"\",PERCENTAGE2!D35)","v":""},{"$f":"IF(eSPAR!A34=\"\",\"\",PERCENTAGE2!E35)","v":""},{"$f":"IF(eSPAR!A34=\"\",\"\",PERCENTAGE2!F35)","v":""},{"$f":"IF(eSPAR!A34=\"\",\"\",PERCENTAGE2!G35)","v":""},{"$f":"IF(eSPAR!A34=\"\",\"\",PERCENTAGE2!H35)","v":""}]
[{"$f":"eSPAR!A35","v":0},{"$f":"eSPAR!B35","v":0},{"$f":"IF(eSPAR!A35=\"\",\"\",PERCENTAGE2!C36)","v":""},{"$f":"IF(eSPAR!A35=\"\",\"\",PERCENTAGE2!D36)","v":""},{"$f":"IF(eSPAR!A35=\"\",\"\",PERCENTAGE2!E36)","v":""},{"$f":"IF(eSPAR!A35=\"\",\"\",PERCENTAGE2!F36)","v":""},{"$f":"IF(eSPAR!A35=\"\",\"\",PERCENTAGE2!G36)","v":""},{"$f":"IF(eSPAR!A35=\"\",\"\",PERCENTAGE2!H36)","v":""}]
[{"$f":"eSPAR!A36","v":0},{"$f":"eSPAR!B36","v":0},{"$f":"IF(eSPAR!A36=\"\",\"\",PERCENTAGE2!C37)","v":""},{"$f":"IF(eSPAR!A36=\"\",\"\",PERCENTAGE2!D37)","v":""},{"$f":"IF(eSPAR!A36=\"\",\"\",PERCENTAGE2!E37)","v":""},{"$f":"IF(eSPAR!A36=\"\",\"\",PERCENTAGE2!F37)","v":""},{"$f":"IF(eSPAR!A36=\"\",\"\",PERCENTAGE2!G37)","v":""},{"$f":"IF(eSPAR!A36=\"\",\"\",PERCENTAGE2!H37)","v":""}]
[{"$f":"eSPAR!A37","v":0},{"$f":"eSPAR!B37","v":0},{"$f":"IF(eSPAR!A37=\"\",\"\",PERCENTAGE2!C38)","v":""},{"$f":"IF(eSPAR!A37=\"\",\"\",PERCENTAGE2!D38)","v":""},{"$f":"IF(eSPAR!A37=\"\",\"\",PERCENTAGE2!E38)","v":""},{"$f":"IF(eSPAR!A37=\"\",\"\",PERCENTAGE2!F38)","v":""},{"$f":"IF(eSPAR!A37=\"\",\"\",PERCENTAGE2!G38)","v":""},{"$f":"IF(eSPAR!A37=\"\",\"\",PERCENTAGE2!H38)","v":""}]
[{"$f":"eSPAR!A38","v":0},{"$f":"eSPAR!B38","v":0},{"$f":"IF(eSPAR!A38=\"\",\"\",PERCENTAGE2!C39)","v":""},{"$f":"IF(eSPAR!A38=\"\",\"\",PERCENTAGE2!D39)","v":""},{"$f":"IF(eSPAR!A38=\"\",\"\",PERCENTAGE2!E39)","v":""},{"$f":"IF(eSPAR!A38=\"\",\"\",PERCENTAGE2!F39)","v":""},{"$f":"IF(eSPAR!A38=\"\",\"\",PERCENTAGE2!G39)","v":""},{"$f":"IF(eSPAR!A38=\"\",\"\",PERCENTAGE2!H39)","v":""}]
[{"$f":"eSPAR!A39","v":0},{"$f":"eSPAR!B39","v":0},{"$f":"IF(eSPAR!A39=\"\",\"\",PERCENTAGE2!C40)","v":""},{"$f":"IF(eSPAR!A39=\"\",\"\",PERCENTAGE2!D40)","v":""},{"$f":"IF(eSPAR!A39=\"\",\"\",PERCENTAGE2!E40)","v":""},{"$f":"IF(eSPAR!A39=\"\",\"\",PERCENTAGE2!F40)","v":""},{"$f":"IF(eSPAR!A39=\"\",\"\",PERCENTAGE2!G40)","v":""},{"$f":"IF(eSPAR!A39=\"\",\"\",PERCENTAGE2!H40)","v":""}]
[{"$f":"eSPAR!A40","v":0},{"$f":"eSPAR!B40","v":0},{"$f":"IF(eSPAR!A40=\"\",\"\",PERCENTAGE2!C41)","v":""},{"$f":"IF(eSPAR!A40=\"\",\"\",PERCENTAGE2!D41)","v":""},{"$f":"IF(eSPAR!A40=\"\",\"\",PERCENTAGE2!E41)","v":""},{"$f":"IF(eSPAR!A40=\"\",\"\",PERCENTAGE2!F41)","v":""},{"$f":"IF(eSPAR!A40=\"\",\"\",PERCENTAGE2!G41)","v":""},{"$f":"IF(eSPAR!A40=\"\",\"\",PERCENTAGE2!H41)","v":""}]
[{"$f":"eSPAR!A41","v":0},{"$f":"eSPAR!B41","v":0},{"$f":"IF(eSPAR!A41=\"\",\"\",PERCENTAGE2!C42)","v":""},{"$f":"IF(eSPAR!A41=\"\",\"\",PERCENTAGE2!D42)","v":""},{"$f":"IF(eSPAR!A41=\"\",\"\",PERCENTAGE2!E42)","v":""},{"$f":"IF(eSPAR!A41=\"\",\"\",PERCENTAGE2!F42)","v":""},{"$f":"IF(eSPAR!A41=\"\",\"\",PERCENTAGE2!G42)","v":""},{"$f":"IF(eSPAR!A41=\"\",\"\",PERCENTAGE2!H42)","v":""}]
[{"$f":"eSPAR!A42","v":0},{"$f":"eSPAR!B42","v":0},{"$f":"IF(eSPAR!A42=\"\",\"\",PERCENTAGE2!C43)","v":""},{"$f":"IF(eSPAR!A42=\"\",\"\",PERCENTAGE2!D43)","v":""},{"$f":"IF(eSPAR!A42=\"\",\"\",PERCENTAGE2!E43)","v":""},{"$f":"IF(eSPAR!A42=\"\",\"\",PERCENTAGE2!F43)","v":""},{"$f":"IF(eSPAR!A42=\"\",\"\",PERCENTAGE2!G43)","v":""},{"$f":"IF(eSPAR!A42=\"\",\"\",PERCENTAGE2!H43)","v":""}]
[{"$f":"eSPAR!A43","v":0},{"$f":"eSPAR!B43","v":0},{"$f":"IF(eSPAR!A43=\"\",\"\",PERCENTAGE2!C44)","v":""},{"$f":"IF(eSPAR!A43=\"\",\"\",PERCENTAGE2!D44)","v":""},{"$f":"IF(eSPAR!A43=\"\",\"\",PERCENTAGE2!E44)","v":""},{"$f":"IF(eSPAR!A43=\"\",\"\",PERCENTAGE2!F44)","v":""},{"$f":"IF(eSPAR!A43=\"\",\"\",PERCENTAGE2!G44)","v":""},{"$f":"IF(eSPAR!A43=\"\",\"\",PERCENTAGE2!H44)","v":""}]
[{"$f":"eSPAR!A44","v":0},{"$f":"eSPAR!B44","v":0},{"$f":"IF(eSPAR!A44=\"\",\"\",PERCENTAGE2!C45)","v":""},{"$f":"IF(eSPAR!A44=\"\",\"\",PERCENTAGE2!D45)","v":""},{"$f":"IF(eSPAR!A44=\"\",\"\",PERCENTAGE2!E45)","v":""},{"$f":"IF(eSPAR!A44=\"\",\"\",PERCENTAGE2!F45)","v":""},{"$f":"IF(eSPAR!A44=\"\",\"\",PERCENTAGE2!G45)","v":""},{"$f":"IF(eSPAR!A44=\"\",\"\",PERCENTAGE2!H45)","v":""}]
[{"$f":"eSPAR!A45","v":0},{"$f":"eSPAR!B45","v":0},{"$f":"IF(eSPAR!A45=\"\",\"\",PERCENTAGE2!C46)","v":""},{"$f":"IF(eSPAR!A45=\"\",\"\",PERCENTAGE2!D46)","v":""},{"$f":"IF(eSPAR!A45=\"\",\"\",PERCENTAGE2!E46)","v":""},{"$f":"IF(eSPAR!A45=\"\",\"\",PERCENTAGE2!F46)","v":""},{"$f":"IF(eSPAR!A45=\"\",\"\",PERCENTAGE2!G46)","v":""},{"$f":"IF(eSPAR!A45=\"\",\"\",PERCENTAGE2!H46)","v":""}]
[{"$f":"eSPAR!A46","v":0},{"$f":"eSPAR!B46","v":0},{"$f":"IF(eSPAR!A46=\"\",\"\",PERCENTAGE2!C47)","v":""},{"$f":"IF(eSPAR!A46=\"\",\"\",PERCENTAGE2!D47)","v":""},{"$f":"IF(eSPAR!A46=\"\",\"\",PERCENTAGE2!E47)","v":""},{"$f":"IF(eSPAR!A46=\"\",\"\",PERCENTAGE2!F47)","v":""},{"$f":"IF(eSPAR!A46=\"\",\"\",PERCENTAGE2!G47)","v":""},{"$f":"IF(eSPAR!A46=\"\",\"\",PERCENTAGE2!H47)","v":""}]
[{"$f":"eSPAR!A47","v":0},{"$f":"eSPAR!B47","v":0},{"$f":"IF(eSPAR!A47=\"\",\"\",PERCENTAGE2!C48)","v":""},{"$f":"IF(eSPAR!A47=\"\",\"\",PERCENTAGE2!D48)","v":""},{"$f":"IF(eSPAR!A47=\"\",\"\",PERCENTAGE2!E48)","v":""},{"$f":"IF(eSPAR!A47=\"\",\"\",PERCENTAGE2!F48)","v":""},{"$f":"IF(eSPAR!A47=\"\",\"\",PERCENTAGE2!G48)","v":""},{"$f":"IF(eSPAR!A47=\"\",\"\",PERCENTAGE2!H48)","v":""}]
[{"$f":"eSPAR!A48","v":0},{"$f":"eSPAR!B48","v":0},{"$f":"IF(eSPAR!A48=\"\",\"\",PERCENTAGE2!C49)","v":""},{"$f":"IF(eSPAR!A48=\"\",\"\",PERCENTAGE2!D49)","v":""},{"$f":"IF(eSPAR!A48=\"\",\"\",PERCENTAGE2!E49)","v":""},{"$f":"IF(eSPAR!A48=\"\",\"\",PERCENTAGE2!F49)","v":""},{"$f":"IF(eSPAR!A48=\"\",\"\",PERCENTAGE2!G49)","v":""},{"$f":"IF(eSPAR!A48=\"\",\"\",PERCENTAGE2!H49)","v":""}]
[{"$f":"eSPAR!A49","v":0},{"$f":"eSPAR!B49","v":0},{"$f":"IF(eSPAR!A49=\"\",\"\",PERCENTAGE2!C50)","v":""},{"$f":"IF(eSPAR!A49=\"\",\"\",PERCENTAGE2!D50)","v":""},{"$f":"IF(eSPAR!A49=\"\",\"\",PERCENTAGE2!E50)","v":""},{"$f":"IF(eSPAR!A49=\"\",\"\",PERCENTAGE2!F50)","v":""},{"$f":"IF(eSPAR!A49=\"\",\"\",PERCENTAGE2!G50)","v":""},{"$f":"IF(eSPAR!A49=\"\",\"\",PERCENTAGE2!H50)","v":""}]
[{"$f":"eSPAR!A50","v":0},{"$f":"eSPAR!B50","v":0},{"$f":"IF(eSPAR!A50=\"\",\"\",PERCENTAGE2!C51)","v":""},{"$f":"IF(eSPAR!A50=\"\",\"\",PERCENTAGE2!D51)","v":""},{"$f":"IF(eSPAR!A50=\"\",\"\",PERCENTAGE2!E51)","v":""},{"$f":"IF(eSPAR!A50=\"\",\"\",PERCENTAGE2!F51)","v":""},{"$f":"IF(eSPAR!A50=\"\",\"\",PERCENTAGE2!G51)","v":""},{"$f":"IF(eSPAR!A50=\"\",\"\",PERCENTAGE2!H51)","v":""}]
[{"$f":"eSPAR!A51","v":0},{"$f":"eSPAR!B51","v":0},{"$f":"IF(eSPAR!A51=\"\",\"\",PERCENTAGE2!C52)","v":""},{"$f":"IF(eSPAR!A51=\"\",\"\",PERCENTAGE2!D52)","v":""},{"$f":"IF(eSPAR!A51=\"\",\"\",PERCENTAGE2!E52)","v":""},{"$f":"IF(eSPAR!A51=\"\",\"\",PERCENTAGE2!F52)","v":""},{"$f":"IF(eSPAR!A51=\"\",\"\",PERCENTAGE2!G52)","v":""},{"$f":"IF(eSPAR!A51=\"\",\"\",PERCENTAGE2!H52)","v":""}]
[{"$f":"eSPAR!A52","v":0},{"$f":"eSPAR!B52","v":0},{"$f":"IF(eSPAR!A52=\"\",\"\",PERCENTAGE2!C53)","v":""},{"$f":"IF(eSPAR!A52=\"\",\"\",PERCENTAGE2!D53)","v":""},{"$f":"IF(eSPAR!A52=\"\",\"\",PERCENTAGE2!E53)","v":""},{"$f":"IF(eSPAR!A52=\"\",\"\",PERCENTAGE2!F53)","v":""},{"$f":"IF(eSPAR!A52=\"\",\"\",PERCENTAGE2!G53)","v":""},{"$f":"IF(eSPAR!A52=\"\",\"\",PERCENTAGE2!H53)","v":""}]
[{"$f":"eSPAR!A53","v":0},{"$f":"eSPAR!B53","v":0},{"$f":"IF(eSPAR!A53=\"\",\"\",PERCENTAGE2!C54)","v":""},{"$f":"IF(eSPAR!A53=\"\",\"\",PERCENTAGE2!D54)","v":""},{"$f":"IF(eSPAR!A53=\"\",\"\",PERCENTAGE2!E54)","v":""},{"$f":"IF(eSPAR!A53=\"\",\"\",PERCENTAGE2!F54)","v":""},{"$f":"IF(eSPAR!A53=\"\",\"\",PERCENTAGE2!G54)","v":""},{"$f":"IF(eSPAR!A53=\"\",\"\",PERCENTAGE2!H54)","v":""}]
[{"$f":"eSPAR!A54","v":0},{"$f":"eSPAR!B54","v":0},{"$f":"IF(eSPAR!A54=\"\",\"\",PERCENTAGE2!C55)","v":""},{"$f":"IF(eSPAR!A54=\"\",\"\",PERCENTAGE2!D55)","v":""},{"$f":"IF(eSPAR!A54=\"\",\"\",PERCENTAGE2!E55)","v":""},{"$f":"IF(eSPAR!A54=\"\",\"\",PERCENTAGE2!F55)","v":""},{"$f":"IF(eSPAR!A54=\"\",\"\",PERCENTAGE2!G55)","v":""},{"$f":"IF(eSPAR!A54=\"\",\"\",PERCENTAGE2!H55)","v":""}]
[{"$f":"eSPAR!A55","v":0},{"$f":"eSPAR!B55","v":0},{"$f":"IF(eSPAR!A55=\"\",\"\",PERCENTAGE2!C56)","v":""},{"$f":"IF(eSPAR!A55=\"\",\"\",PERCENTAGE2!D56)","v":""},{"$f":"IF(eSPAR!A55=\"\",\"\",PERCENTAGE2!E56)","v":""},{"$f":"IF(eSPAR!A55=\"\",\"\",PERCENTAGE2!F56)","v":""},{"$f":"IF(eSPAR!A55=\"\",\"\",PERCENTAGE2!G56)","v":""},{"$f":"IF(eSPAR!A55=\"\",\"\",PERCENTAGE2!H56)","v":""}]
[{"$f":"eSPAR!A56","v":0},{"$f":"eSPAR!B56","v":0},{"$f":"IF(eSPAR!A56=\"\",\"\",PERCENTAGE2!C57)","v":""},{"$f":"IF(eSPAR!A56=\"\",\"\",PERCENTAGE2!D57)","v":""},{"$f":"IF(eSPAR!A56=\"\",\"\",PERCENTAGE2!E57)","v":""},{"$f":"IF(eSPAR!A56=\"\",\"\",PERCENTAGE2!F57)","v":""},{"$f":"IF(eSPAR!A56=\"\",\"\",PERCENTAGE2!G57)","v":""},{"$f":"IF(eSPAR!A56=\"\",\"\",PERCENTAGE2!H57)","v":""}]
[{"$f":"eSPAR!A57","v":0},{"$f":"eSPAR!B57","v":0},{"$f":"IF(eSPAR!A57=\"\",\"\",PERCENTAGE2!C58)","v":""},{"$f":"IF(eSPAR!A57=\"\",\"\",PERCENTAGE2!D58)","v":""},{"$f":"IF(eSPAR!A57=\"\",\"\",PERCENTAGE2!E58)","v":""},{"$f":"IF(eSPAR!A57=\"\",\"\",PERCENTAGE2!F58)","v":""},{"$f":"IF(eSPAR!A57=\"\",\"\",PERCENTAGE2!G58)","v":""},{"$f":"IF(eSPAR!A57=\"\",\"\",PERCENTAGE2!H58)","v":""}]
[{"$f":"eSPAR!A58","v":0},{"$f":"eSPAR!B58","v":0},{"$f":"IF(eSPAR!A58=\"\",\"\",PERCENTAGE2!C59)","v":""},{"$f":"IF(eSPAR!A58=\"\",\"\",PERCENTAGE2!D59)","v":""},{"$f":"IF(eSPAR!A58=\"\",\"\",PERCENTAGE2!E59)","v":""},{"$f":"IF(eSPAR!A58=\"\",\"\",PERCENTAGE2!F59)","v":""},{"$f":"IF(eSPAR!A58=\"\",\"\",PERCENTAGE2!G59)","v":""},{"$f":"IF(eSPAR!A58=\"\",\"\",PERCENTAGE2!H59)","v":""}]
[{"$f":"eSPAR!A59","v":0},{"$f":"eSPAR!B59","v":0},{"$f":"IF(eSPAR!A59=\"\",\"\",PERCENTAGE2!C60)","v":""},{"$f":"IF(eSPAR!A59=\"\",\"\",PERCENTAGE2!D60)","v":""},{"$f":"IF(eSPAR!A59=\"\",\"\",PERCENTAGE2!E60)","v":""},{"$f":"IF(eSPAR!A59=\"\",\"\",PERCENTAGE2!F60)","v":""},{"$f":"IF(eSPAR!A59=\"\",\"\",PERCENTAGE2!G60)","v":""},{"$f":"IF(eSPAR!A59=\"\",\"\",PERCENTAGE2!H60)","v":""}]
[{"$f":"eSPAR!A60","v":0},{"$f":"eSPAR!B60","v":0},{"$f":"IF(eSPAR!A60=\"\",\"\",PERCENTAGE2!C61)","v":""},{"$f":"IF(eSPAR!A60=\"\",\"\",PERCENTAGE2!D61)","v":""},{"$f":"IF(eSPAR!A60=\"\",\"\",PERCENTAGE2!E61)","v":""},{"$f":"IF(eSPAR!A60=\"\",\"\",PERCENTAGE2!F61)","v":""},{"$f":"IF(eSPAR!A60=\"\",\"\",PERCENTAGE2!G61)","v":""},{"$f":"IF(eSPAR!A60=\"\",\"\",PERCENTAGE2!H61)","v":""}]
[{"$f":"eSPAR!A61","v":0},{"$f":"eSPAR!B61","v":0},{"$f":"IF(eSPAR!A61=\"\",\"\",PERCENTAGE2!C62)","v":""},{"$f":"IF(eSPAR!A61=\"\",\"\",PERCENTAGE2!D62)","v":""},{"$f":"IF(eSPAR!A61=\"\",\"\",PERCENTAGE2!E62)","v":""},{"$f":"IF(eSPAR!A61=\"\",\"\",PERCENTAGE2!F62)","v":""},{"$f":"IF(eSPAR!A61=\"\",\"\",PERCENTAGE2!G62)","v":""},{"$f":"IF(eSPAR!A61=\"\",\"\",PERCENTAGE2!H62)","v":""}]
[{"$f":"eSPAR!A62","v":0},{"$f":"eSPAR!B62","v":0},{"$f":"IF(eSPAR!A62=\"\",\"\",PERCENTAGE2!C63)","v":""},{"$f":"IF(eSPAR!A62=\"\",\"\",PERCENTAGE2!D63)","v":""},{"$f":"IF(eSPAR!A62=\"\",\"\",PERCENTAGE2!E63)","v":""},{"$f":"IF(eSPAR!A62=\"\",\"\",PERCENTAGE2!F63)","v":""},{"$f":"IF(eSPAR!A62=\"\",\"\",PERCENTAGE2!G63)","v":""},{"$f":"IF(eSPAR!A62=\"\",\"\",PERCENTAGE2!H63)","v":""}]
[{"$f":"eSPAR!A63","v":0},{"$f":"eSPAR!B63","v":0},{"$f":"IF(eSPAR!A63=\"\",\"\",PERCENTAGE2!C64)","v":""},{"$f":"IF(eSPAR!A63=\"\",\"\",PERCENTAGE2!D64)","v":""},{"$f":"IF(eSPAR!A63=\"\",\"\",PERCENTAGE2!E64)","v":""},{"$f":"IF(eSPAR!A63=\"\",\"\",PERCENTAGE2!F64)","v":""},{"$f":"IF(eSPAR!A63=\"\",\"\",PERCENTAGE2!G64)","v":""},{"$f":"IF(eSPAR!A63=\"\",\"\",PERCENTAGE2!H64)","v":""}]
[{"$f":"eSPAR!A64","v":0},{"$f":"eSPAR!B64","v":0},{"$f":"IF(eSPAR!A64=\"\",\"\",PERCENTAGE2!C65)","v":""},{"$f":"IF(eSPAR!A64=\"\",\"\",PERCENTAGE2!D65)","v":""},{"$f":"IF(eSPAR!A64=\"\",\"\",PERCENTAGE2!E65)","v":""},{"$f":"IF(eSPAR!A64=\"\",\"\",PERCENTAGE2!F65)","v":""},{"$f":"IF(eSPAR!A64=\"\",\"\",PERCENTAGE2!G65)","v":""},{"$f":"IF(eSPAR!A64=\"\",\"\",PERCENTAGE2!H65)","v":""}]
[{"$f":"eSPAR!A65","v":0},{"$f":"eSPAR!B65","v":0},{"$f":"IF(eSPAR!A65=\"\",\"\",PERCENTAGE2!C66)","v":""},{"$f":"IF(eSPAR!A65=\"\",\"\",PERCENTAGE2!D66)","v":""},{"$f":"IF(eSPAR!A65=\"\",\"\",PERCENTAGE2!E66)","v":""},{"$f":"IF(eSPAR!A65=\"\",\"\",PERCENTAGE2!F66)","v":""},{"$f":"IF(eSPAR!A65=\"\",\"\",PERCENTAGE2!G66)","v":""},{"$f":"IF(eSPAR!A65=\"\",\"\",PERCENTAGE2!H66)","v":""}]
[{"$f":"eSPAR!A66","v":0},{"$f":"eSPAR!B66","v":0},{"$f":"IF(eSPAR!A66=\"\",\"\",PERCENTAGE2!C67)","v":""},{"$f":"IF(eSPAR!A66=\"\",\"\",PERCENTAGE2!D67)","v":""},{"$f":"IF(eSPAR!A66=\"\",\"\",PERCENTAGE2!E67)","v":""},{"$f":"IF(eSPAR!A66=\"\",\"\",PERCENTAGE2!F67)","v":""},{"$f":"IF(eSPAR!A66=\"\",\"\",PERCENTAGE2!G67)","v":""},{"$f":"IF(eSPAR!A66=\"\",\"\",PERCENTAGE2!H67)","v":""}]
[{"$f":"eSPAR!A67","v":0},{"$f":"eSPAR!B67","v":0},{"$f":"IF(eSPAR!A67=\"\",\"\",PERCENTAGE2!C68)","v":""},{"$f":"IF(eSPAR!A67=\"\",\"\",PERCENTAGE2!D68)","v":""},{"$f":"IF(eSPAR!A67=\"\",\"\",PERCENTAGE2!E68)","v":""},{"$f":"IF(eSPAR!A67=\"\",\"\",PERCENTAGE2!F68)","v":""},{"$f":"IF(eSPAR!A67=\"\",\"\",PERCENTAGE2!G68)","v":""},{"$f":"IF(eSPAR!A67=\"\",\"\",PERCENTAGE2!H68)","v":""}]
[{"$f":"eSPAR!A68","v":0},{"$f":"eSPAR!B68","v":0},{"$f":"IF(eSPAR!A68=\"\",\"\",PERCENTAGE2!C69)","v":""},{"$f":"IF(eSPAR!A68=\"\",\"\",PERCENTAGE2!D69)","v":""},{"$f":"IF(eSPAR!A68=\"\",\"\",PERCENTAGE2!E69)","v":""},{"$f":"IF(eSPAR!A68=\"\",\"\",PERCENTAGE2!F69)","v":""},{"$f":"IF(eSPAR!A68=\"\",\"\",PERCENTAGE2!G69)","v":""},{"$f":"IF(eSPAR!A68=\"\",\"\",PERCENTAGE2!H69)","v":""}]
[{"$f":"eSPAR!A69","v":0},{"$f":"eSPAR!B69","v":0},{"$f":"IF(eSPAR!A69=\"\",\"\",PERCENTAGE2!C70)","v":""},{"$f":"IF(eSPAR!A69=\"\",\"\",PERCENTAGE2!D70)","v":""},{"$f":"IF(eSPAR!A69=\"\",\"\",PERCENTAGE2!E70)","v":""},{"$f":"IF(eSPAR!A69=\"\",\"\",PERCENTAGE2!F70)","v":""},{"$f":"IF(eSPAR!A69=\"\",\"\",PERCENTAGE2!G70)","v":""},{"$f":"IF(eSPAR!A69=\"\",\"\",PERCENTAGE2!H70)","v":""}]
[{"$f":"eSPAR!A70","v":0},{"$f":"eSPAR!B70","v":0},{"$f":"IF(eSPAR!A70=\"\",\"\",PERCENTAGE2!C71)","v":""},{"$f":"IF(eSPAR!A70=\"\",\"\",PERCENTAGE2!D71)","v":""},{"$f":"IF(eSPAR!A70=\"\",\"\",PERCENTAGE2!E71)","v":""},{"$f":"IF(eSPAR!A70=\"\",\"\",PERCENTAGE2!F71)","v":""},{"$f":"IF(eSPAR!A70=\"\",\"\",PERCENTAGE2!G71)","v":""},{"$f":"IF(eSPAR!A70=\"\",\"\",PERCENTAGE2!H71)","v":""}]
[{"$f":"eSPAR!A71","v":0},{"$f":"eSPAR!B71","v":0},{"$f":"IF(eSPAR!A71=\"\",\"\",PERCENTAGE2!C72)","v":""},{"$f":"IF(eSPAR!A71=\"\",\"\",PERCENTAGE2!D72)","v":""},{"$f":"IF(eSPAR!A71=\"\",\"\",PERCENTAGE2!E72)","v":""},{"$f":"IF(eSPAR!A71=\"\",\"\",PERCENTAGE2!F72)","v":""},{"$f":"IF(eSPAR!A71=\"\",\"\",PERCENTAGE2!G72)","v":""},{"$f":"IF(eSPAR!A71=\"\",\"\",PERCENTAGE2!H72)","v":""}]
[{"$f":"eSPAR!A72","v":0},{"$f":"eSPAR!B72","v":0},{"$f":"IF(eSPAR!A72=\"\",\"\",PERCENTAGE2!C73)","v":""},{"$f":"IF(eSPAR!A72=\"\",\"\",PERCENTAGE2!D73)","v":""},{"$f":"IF(eSPAR!A72=\"\",\"\",PERCENTAGE2!E73)","v":""},{"$f":"IF(eSPAR!A72=\"\",\"\",PERCENTAGE2!F73)","v":""},{"$f":"IF(eSPAR!A72=\"\",\"\",PERCENTAGE2!G73)","v":""},{"$f":"IF(eSPAR!A72=\"\",\"\",PERCENTAGE2!H73)","v":""}]
[{"$f":"eSPAR!A73","v":0},{"$f":"eSPAR!B73","v":0},{"$f":"IF(eSPAR!A73=\"\",\"\",PERCENTAGE2!C74)","v":""},{"$f":"IF(eSPAR!A73=\"\",\"\",PERCENTAGE2!D74)","v":""},{"$f":"IF(eSPAR!A73=\"\",\"\",PERCENTAGE2!E74)","v":""},{"$f":"IF(eSPAR!A73=\"\",\"\",PERCENTAGE2!F74)","v":""},{"$f":"IF(eSPAR!A73=\"\",\"\",PERCENTAGE2!G74)","v":""},{"$f":"IF(eSPAR!A73=\"\",\"\",PERCENTAGE2!H74)","v":""}]
[{"$f":"eSPAR!A74","v":0},{"$f":"eSPAR!B74","v":0},{"$f":"IF(eSPAR!A74=\"\",\"\",PERCENTAGE2!C75)","v":""},{"$f":"IF(eSPAR!A74=\"\",\"\",PERCENTAGE2!D75)","v":""},{"$f":"IF(eSPAR!A74=\"\",\"\",PERCENTAGE2!E75)","v":""},{"$f":"IF(eSPAR!A74=\"\",\"\",PERCENTAGE2!F75)","v":""},{"$f":"IF(eSPAR!A74=\"\",\"\",PERCENTAGE2!G75)","v":""},{"$f":"IF(eSPAR!A74=\"\",\"\",PERCENTAGE2!H75)","v":""}]
[{"$f":"eSPAR!A75","v":0},{"$f":"eSPAR!B75","v":0},{"$f":"IF(eSPAR!A75=\"\",\"\",PERCENTAGE2!C76)","v":""},{"$f":"IF(eSPAR!A75=\"\",\"\",PERCENTAGE2!D76)","v":""},{"$f":"IF(eSPAR!A75=\"\",\"\",PERCENTAGE2!E76)","v":""},{"$f":"IF(eSPAR!A75=\"\",\"\",PERCENTAGE2!F76)","v":""},{"$f":"IF(eSPAR!A75=\"\",\"\",PERCENTAGE2!G76)","v":""},{"$f":"IF(eSPAR!A75=\"\",\"\",PERCENTAGE2!H76)","v":""}]
[{"$f":"eSPAR!A76","v":0},{"$f":"eSPAR!B76","v":0},{"$f":"IF(eSPAR!A76=\"\",\"\",PERCENTAGE2!C77)","v":""},{"$f":"IF(eSPAR!A76=\"\",\"\",PERCENTAGE2!D77)","v":""},{"$f":"IF(eSPAR!A76=\"\",\"\",PERCENTAGE2!E77)","v":""},{"$f":"IF(eSPAR!A76=\"\",\"\",PERCENTAGE2!F77)","v":""},{"$f":"IF(eSPAR!A76=\"\",\"\",PERCENTAGE2!G77)","v":""},{"$f":"IF(eSPAR!A76=\"\",\"\",PERCENTAGE2!H77)","v":""}]
[{"$f":"eSPAR!A77","v":0},{"$f":"eSPAR!B77","v":0},{"$f":"IF(eSPAR!A77=\"\",\"\",PERCENTAGE2!C78)","v":""},{"$f":"IF(eSPAR!A77=\"\",\"\",PERCENTAGE2!D78)","v":""},{"$f":"IF(eSPAR!A77=\"\",\"\",PERCENTAGE2!E78)","v":""},{"$f":"IF(eSPAR!A77=\"\",\"\",PERCENTAGE2!F78)","v":""},{"$f":"IF(eSPAR!A77=\"\",\"\",PERCENTAGE2!G78)","v":""},{"$f":"IF(eSPAR!A77=\"\",\"\",PERCENTAGE2!H78)","v":""}]
[{"$f":"eSPAR!A78","v":0},{"$f":"eSPAR!B78","v":0},{"$f":"IF(eSPAR!A78=\"\",\"\",PERCENTAGE2!C79)","v":""},{"$f":"IF(eSPAR!A78=\"\",\"\",PERCENTAGE2!D79)","v":""},{"$f":"IF(eSPAR!A78=\"\",\"\",PERCENTAGE2!E79)","v":""},{"$f":"IF(eSPAR!A78=\"\",\"\",PERCENTAGE2!F79)","v":""},{"$f":"IF(eSPAR!A78=\"\",\"\",PERCENTAGE2!G79)","v":""},{"$f":"IF(eSPAR!A78=\"\",\"\",PERCENTAGE2!H79)","v":""}]
[{"$f":"eSPAR!A79","v":0},{"$f":"eSPAR!B79","v":0},{"$f":"IF(eSPAR!A79=\"\",\"\",PERCENTAGE2!C80)","v":""},{"$f":"IF(eSPAR!A79=\"\",\"\",PERCENTAGE2!D80)","v":""},{"$f":"IF(eSPAR!A79=\"\",\"\",PERCENTAGE2!E80)","v":""},{"$f":"IF(eSPAR!A79=\"\",\"\",PERCENTAGE2!F80)","v":""},{"$f":"IF(eSPAR!A79=\"\",\"\",PERCENTAGE2!G80)","v":""},{"$f":"IF(eSPAR!A79=\"\",\"\",PERCENTAGE2!H80)","v":""}]
[{"$f":"eSPAR!A80","v":0},{"$f":"eSPAR!B80","v":0},{"$f":"IF(eSPAR!A80=\"\",\"\",PERCENTAGE2!C81)","v":""},{"$f":"IF(eSPAR!A80=\"\",\"\",PERCENTAGE2!D81)","v":""},{"$f":"IF(eSPAR!A80=\"\",\"\",PERCENTAGE2!E81)","v":""},{"$f":"IF(eSPAR!A80=\"\",\"\",PERCENTAGE2!F81)","v":""},{"$f":"IF(eSPAR!A80=\"\",\"\",PERCENTAGE2!G81)","v":""},{"$f":"IF(eSPAR!A80=\"\",\"\",PERCENTAGE2!H81)","v":""}]
[{"$f":"eSPAR!A81","v":0},{"$f":"eSPAR!B81","v":0},{"$f":"IF(eSPAR!A81=\"\",\"\",PERCENTAGE2!C82)","v":""},{"$f":"IF(eSPAR!A81=\"\",\"\",PERCENTAGE2!D82)","v":""},{"$f":"IF(eSPAR!A81=\"\",\"\",PERCENTAGE2!E82)","v":""},{"$f":"IF(eSPAR!A81=\"\",\"\",PERCENTAGE2!F82)","v":""},{"$f":"IF(eSPAR!A81=\"\",\"\",PERCENTAGE2!G82)","v":""},{"$f":"IF(eSPAR!A81=\"\",\"\",PERCENTAGE2!H82)","v":""}]
[{"$f":"eSPAR!A82","v":0},{"$f":"eSPAR!B82","v":0},{"$f":"IF(eSPAR!A82=\"\",\"\",PERCENTAGE2!C83)","v":""},{"$f":"IF(eSPAR!A82=\"\",\"\",PERCENTAGE2!D83)","v":""},{"$f":"IF(eSPAR!A82=\"\",\"\",PERCENTAGE2!E83)","v":""},{"$f":"IF(eSPAR!A82=\"\",\"\",PERCENTAGE2!F83)","v":""},{"$f":"IF(eSPAR!A82=\"\",\"\",PERCENTAGE2!G83)","v":""},{"$f":"IF(eSPAR!A82=\"\",\"\",PERCENTAGE2!H83)","v":""}]
[{"$f":"eSPAR!A83","v":0},{"$f":"eSPAR!B83","v":0},{"$f":"IF(eSPAR!A83=\"\",\"\",PERCENTAGE2!C84)","v":""},{"$f":"IF(eSPAR!A83=\"\",\"\",PERCENTAGE2!D84)","v":""},{"$f":"IF(eSPAR!A83=\"\",\"\",PERCENTAGE2!E84)","v":""},{"$f":"IF(eSPAR!A83=\"\",\"\",PERCENTAGE2!F84)","v":""},{"$f":"IF(eSPAR!A83=\"\",\"\",PERCENTAGE2!G84)","v":""},{"$f":"IF(eSPAR!A83=\"\",\"\",PERCENTAGE2!H84)","v":""}]
[{"$f":"eSPAR!A84","v":0},{"$f":"eSPAR!B84","v":0},{"$f":"IF(eSPAR!A84=\"\",\"\",PERCENTAGE2!C85)","v":""},{"$f":"IF(eSPAR!A84=\"\",\"\",PERCENTAGE2!D85)","v":""},{"$f":"IF(eSPAR!A84=\"\",\"\",PERCENTAGE2!E85)","v":""},{"$f":"IF(eSPAR!A84=\"\",\"\",PERCENTAGE2!F85)","v":""},{"$f":"IF(eSPAR!A84=\"\",\"\",PERCENTAGE2!G85)","v":""},{"$f":"IF(eSPAR!A84=\"\",\"\",PERCENTAGE2!H85)","v":""}]
[{"$f":"eSPAR!A85","v":0},{"$f":"eSPAR!B85","v":0},{"$f":"IF(eSPAR!A85=\"\",\"\",PERCENTAGE2!C86)","v":""},{"$f":"IF(eSPAR!A85=\"\",\"\",PERCENTAGE2!D86)","v":""},{"$f":"IF(eSPAR!A85=\"\",\"\",PERCENTAGE2!E86)","v":""},{"$f":"IF(eSPAR!A85=\"\",\"\",PERCENTAGE2!F86)","v":""},{"$f":"IF(eSPAR!A85=\"\",\"\",PERCENTAGE2!G86)","v":""},{"$f":"IF(eSPAR!A85=\"\",\"\",PERCENTAGE2!H86)","v":""}]

{"sheet":"pPT2-H","index":16,"n_rows":86,"n_cols":8,"rows_kept":86,"cut":false,"hidden":true,"merged":[[3,7,4,7],[0,0,0,7],[1,0,1,7],[2,0,2,7],[3,0,5,0],[3,1,4,1],[3,2,4,2],[3,3,4,3],[3,4,4,4],[3,5,4,5],[3,6,4,6]]}
[{"$f":"Internal!C25","v":"Golden Valley School"}]
[{"$f":"Internal!B34","v":"Class : IX"}]
[{"$f":"\"Periodic Test 2 (\"&Internal!B33&\")\"","v":"Periodic Test 2 (Academic Session: 2017-18)"}]
["Roll No.","Name",{"$f":"eSUBMAR!B6","v":"English"},{"$f":"eSUBMAR!B7","v":"Hindi"},{"$f":"eSUBMAR!B8","v":"Mathematics"},{"$f":"eSUBMAR!B9","v":"Science"},{"$f":"eSUBMAR!B10","v":"Social Studies"},{"$f":"eSUBMAR!B11","v":"I.T."}]
[]
[null,"Max. Marks>>",10,10,10,10,10,10]
[{"$f":"eSPAR!A6","v":1},{"$f":"eSPAR!B6","v":"Aman Kumar"},{"$f":"IF(eSPAR!A6=\"\",\"\",PERCENTAGE2!M7)","v":6},{"$f":"IF(eSPAR!A6=\"\",\"\",PERCENTAGE2!N7)","v":7},{"$f":"IF(eSPAR!A6=\"\",\"\",PERCENTAGE2!O7)","v":5},{"$f":"IF(eSPAR!A6=\"\",\"\",PERCENTAGE2!P7)","v":6},{"$f":"IF(eSPAR!A6=\"\",\"\",PERCENTAGE2!Q7)","v":5},{"$f":"IF(eSPAR!A6=\"\",\"\",PERCENTAGE2!R7)","v":6}]
[{"$f":"eSPAR!A7","v":2},{"$f":"eSPAR!B7","v":0},{"$f":"IF(eSPAR!A7=\"\",\"\",PERCENTAGE2!M8)","v":0},{"$f":"IF(eSPAR!A7=\"\",\"\",PERCENTAGE2!N8)","v":0},{"$f":"IF(eSPAR!A7=\"\",\"\",PERCENTAGE2!O8)","v":0},{"$f":"IF(eSPAR!A7=\"\",\"\",PERCENTAGE2!P8)","v":0},{"$f":"IF(eSPAR!A7=\"\",\"\",PERCENTAGE2!Q8)","v":0},{"$f":"IF(eSPAR!A7=\"\",\"\",PERCENTAGE2!R8)","v":0}]
[{"$f":"eSPAR!A8","v":0},{"$f":"eSPAR!B8","v":0},{"$f":"IF(eSPAR!A8=\"\",\"\",PERCENTAGE2!M9)","v":""},{"$f":"IF(eSPAR!A8=\"\",\"\",PERCENTAGE2!N9)","v":""},{"$f":"IF(eSPAR!A8=\"\",\"\",PERCENTAGE2!O9)","v":""},{"$f":"IF(eSPAR!A8=\"\",\"\",PERCENTAGE2!P9)","v":""},{"$f":"IF(eSPAR!A8=\"\",\"\",PERCENTAGE2!Q9)","v":""},{"$f":"IF(eSPAR!A8=\"\",\"\",PERCENTAGE2!R9)","v":""}]
[{"$f":"eSPAR!A9","v":0},{"$f":"eSPAR!B9","v":0},{"$f":"IF(eSPAR!A9=\"\",\"\",PERCENTAGE2!M10)","v":""},{"$f":"IF(eSPAR!A9=\"\",\"\",PERCENTAGE2!N10)","v":""},{"$f":"IF(eSPAR!A9=\"\",\"\",PERCENTAGE2!O10)","v":""},{"$f":"IF(eSPAR!A9=\"\",\"\",PERCENTAGE2!P10)","v":""},{"$f":"IF(eSPAR!A9=\"\",\"\",PERCENTAGE2!Q10)","v":""},{"$f":"IF(eSPAR!A9=\"\",\"\",PERCENTAGE2!R10)","v":""}]
[{"$f":"eSPAR!A10","v":0},{"$f":"eSPAR!B10","v":0},{"$f":"IF(eSPAR!A10=\"\",\"\",PERCENTAGE2!M11)","v":""},{"$f":"IF(eSPAR!A10=\"\",\"\",PERCENTAGE2!N11)","v":""},{"$f":"IF(eSPAR!A10=\"\",\"\",PERCENTAGE2!O11)","v":""},{"$f":"IF(eSPAR!A10=\"\",\"\",PERCENTAGE2!P11)","v":""},{"$f":"IF(eSPAR!A10=\"\",\"\",PERCENTAGE2!Q11)","v":""},{"$f":"IF(eSPAR!A10=\"\",\"\",PERCENTAGE2!R11)","v":""}]
[{"$f":"eSPAR!A11","v":0},{"$f":"eSPAR!B11","v":0},{"$f":"IF(eSPAR!A11=\"\",\"\",PERCENTAGE2!M12)","v":""},{"$f":"IF(eSPAR!A11=\"\",\"\",PERCENTAGE2!N12)","v":""},{"$f":"IF(eSPAR!A11=\"\",\"\",PERCENTAGE2!O12)","v":""},{"$f":"IF(eSPAR!A11=\"\",\"\",PERCENTAGE2!P12)","v":""},{"$f":"IF(eSPAR!A11=\"\",\"\",PERCENTAGE2!Q12)","v":""},{"$f":"IF(eSPAR!A11=\"\",\"\",PERCENTAGE2!R12)","v":""}]
[{"$f":"eSPAR!A12","v":0},{"$f":"eSPAR!B12","v":0},{"$f":"IF(eSPAR!A12=\"\",\"\",PERCENTAGE2!M13)","v":""},{"$f":"IF(eSPAR!A12=\"\",\"\",PERCENTAGE2!N13)","v":""},{"$f":"IF(eSPAR!A12=\"\",\"\",PERCENTAGE2!O13)","v":""},{"$f":"IF(eSPAR!A12=\"\",\"\",PERCENTAGE2!P13)","v":""},{"$f":"IF(eSPAR!A12=\"\",\"\",PERCENTAGE2!Q13)","v":""},{"$f":"IF(eSPAR!A12=\"\",\"\",PERCENTAGE2!R13)","v":""}]
[{"$f":"eSPAR!A13","v":0},{"$f":"eSPAR!B13","v":0},{"$f":"IF(eSPAR!A13=\"\",\"\",PERCENTAGE2!M14)","v":""},{"$f":"IF(eSPAR!A13=\"\",\"\",PERCENTAGE2!N14)","v":""},{"$f":"IF(eSPAR!A13=\"\",\"\",PERCENTAGE2!O14)","v":""},{"$f":"IF(eSPAR!A13=\"\",\"\",PERCENTAGE2!P14)","v":""},{"$f":"IF(eSPAR!A13=\"\",\"\",PERCENTAGE2!Q14)","v":""},{"$f":"IF(eSPAR!A13=\"\",\"\",PERCENTAGE2!R14)","v":""}]
[{"$f":"eSPAR!A14","v":0},{"$f":"eSPAR!B14","v":0},{"$f":"IF(eSPAR!A14=\"\",\"\",PERCENTAGE2!M15)","v":""},{"$f":"IF(eSPAR!A14=\"\",\"\",PERCENTAGE2!N15)","v":""},{"$f":"IF(eSPAR!A14=\"\",\"\",PERCENTAGE2!O15)","v":""},{"$f":"IF(eSPAR!A14=\"\",\"\",PERCENTAGE2!P15)","v":""},{"$f":"IF(eSPAR!A14=\"\",\"\",PERCENTAGE2!Q15)","v":""},{"$f":"IF(eSPAR!A14=\"\",\"\",PERCENTAGE2!R15)","v":""}]
[{"$f":"eSPAR!A15","v":0},{"$f":"eSPAR!B15","v":0},{"$f":"IF(eSPAR!A15=\"\",\"\",PERCENTAGE2!M16)","v":""},{"$f":"IF(eSPAR!A15=\"\",\"\",PERCENTAGE2!N16)","v":""},{"$f":"IF(eSPAR!A15=\"\",\"\",PERCENTAGE2!O16)","v":""},{"$f":"IF(eSPAR!A15=\"\",\"\",PERCENTAGE2!P16)","v":""},{"$f":"IF(eSPAR!A15=\"\",\"\",PERCENTAGE2!Q16)","v":""},{"$f":"IF(eSPAR!A15=\"\",\"\",PERCENTAGE2!R16)","v":""}]
[{"$f":"eSPAR!A16","v":0},{"$f":"eSPAR!B16","v":0},{"$f":"IF(eSPAR!A16=\"\",\"\",PERCENTAGE2!M17)","v":""},{"$f":"IF(eSPAR!A16=\"\",\"\",PERCENTAGE2!N17)","v":""},{"$f":"IF(eSPAR!A16=\"\",\"\",PERCENTAGE2!O17)","v":""},{"$f":"IF(eSPAR!A16=\"\",\"\",PERCENTAGE2!P17)","v":""},{"$f":"IF(eSPAR!A16=\"\",\"\",PERCENTAGE2!Q17)","v":""},{"$f":"IF(eSPAR!A16=\"\",\"\",PERCENTAGE2!R17)","v":""}]
[{"$f":"eSPAR!A17","v":0},{"$f":"eSPAR!B17","v":0},{"$f":"IF(eSPAR!A17=\"\",\"\",PERCENTAGE2!M18)","v":""},{"$f":"IF(eSPAR!A17=\"\",\"\",PERCENTAGE2!N18)","v":""},{"$f":"IF(eSPAR!A17=\"\",\"\",PERCENTAGE2!O18)","v":""},{"$f":"IF(eSPAR!A17=\"\",\"\",PERCENTAGE2!P18)","v":""},{"$f":"IF(eSPAR!A17=\"\",\"\",PERCENTAGE2!Q18)","v":""},{"$f":"IF(eSPAR!A17=\"\",\"\",PERCENTAGE2!R18)","v":""}]
[{"$f":"eSPAR!A18","v":0},{"$f":"eSPAR!B18","v":0},{"$f":"IF(eSPAR!A18=\"\",\"\",PERCENTAGE2!M19)","v":""},{"$f":"IF(eSPAR!A18=\"\",\"\",PERCENTAGE2!N19)","v":""},{"$f":"IF(eSPAR!A18=\"\",\"\",PERCENTAGE2!O19)","v":""},{"$f":"IF(eSPAR!A18=\"\",\"\",PERCENTAGE2!P19)","v":""},{"$f":"IF(eSPAR!A18=\"\",\"\",PERCENTAGE2!Q19)","v":""},{"$f":"IF(eSPAR!A18=\"\",\"\",PERCENTAGE2!R19)","v":""}]
[{"$f":"eSPAR!A19","v":0},{"$f":"eSPAR!B19","v":0},{"$f":"IF(eSPAR!A19=\"\",\"\",PERCENTAGE2!M20)","v":""},{"$f":"IF(eSPAR!A19=\"\",\"\",PERCENTAGE2!N20)","v":""},{"$f":"IF(eSPAR!A19=\"\",\"\",PERCENTAGE2!O20)","v":""},{"$f":"IF(eSPAR!A19=\"\",\"\",PERCENTAGE2!P20)","v":""},{"$f":"IF(eSPAR!A19=\"\",\"\",PERCENTAGE2!Q20)","v":""},{"$f":"IF(eSPAR!A19=\"\",\"\",PERCENTAGE2!R20)","v":""}]
[{"$f":"eSPAR!A20","v":0},{"$f":"eSPAR!B20","v":0},{"$f":"IF(eSPAR!A20=\"\",\"\",PERCENTAGE2!M21)","v":""},{"$f":"IF(eSPAR!A20=\"\",\"\",PERCENTAGE2!N21)","v":""},{"$f":"IF(eSPAR!A20=\"\",\"\",PERCENTAGE2!O21)","v":""},{"$f":"IF(eSPAR!A20=\"\",\"\",PERCENTAGE2!P21)","v":""},{"$f":"IF(eSPAR!A20=\"\",\"\",PERCENTAGE2!Q21)","v":""},{"$f":"IF(eSPAR!A20=\"\",\"\",PERCENTAGE2!R21)","v":""}]
[{"$f":"eSPAR!A21","v":0},{"$f":"eSPAR!B21","v":0},{"$f":"IF(eSPAR!A21=\"\",\"\",PERCENTAGE2!M22)","v":""},{"$f":"IF(eSPAR!A21=\"\",\"\",PERCENTAGE2!N22)","v":""},{"$f":"IF(eSPAR!A21=\"\",\"\",PERCENTAGE2!O22)","v":""},{"$f":"IF(eSPAR!A21=\"\",\"\",PERCENTAGE2!P22)","v":""},{"$f":"IF(eSPAR!A21=\"\",\"\",PERCENTAGE2!Q22)","v":""},{"$f":"IF(eSPAR!A21=\"\",\"\",PERCENTAGE2!R22)","v":""}]
[{"$f":"eSPAR!A22","v":0},{"$f":"eSPAR!B22","v":0},{"$f":"IF(eSPAR!A22=\"\",\"\",PERCENTAGE2!M23)","v":""},{"$f":"IF(eSPAR!A22=\"\",\"\",PERCENTAGE2!N23)","v":""},{"$f":"IF(eSPAR!A22=\"\",\"\",PERCENTAGE2!O23)","v":""},{"$f":"IF(eSPAR!A22=\"\",\"\",PERCENTAGE2!P23)","v":""},{"$f":"IF(eSPAR!A22=\"\",\"\",PERCENTAGE2!Q23)","v":""},{"$f":"IF(eSPAR!A22=\"\",\"\",PERCENTAGE2!R23)","v":""}]
[{"$f":"eSPAR!A23","v":0},{"$f":"eSPAR!B23","v":0},{"$f":"IF(eSPAR!A23=\"\",\"\",PERCENTAGE2!M24)","v":""},{"$f":"IF(eSPAR!A23=\"\",\"\",PERCENTAGE2!N24)","v":""},{"$f":"IF(eSPAR!A23=\"\",\"\",PERCENTAGE2!O24)","v":""},{"$f":"IF(eSPAR!A23=\"\",\"\",PERCENTAGE2!P24)","v":""},{"$f":"IF(eSPAR!A23=\"\",\"\",PERCENTAGE2!Q24)","v":""},{"$f":"IF(eSPAR!A23=\"\",\"\",PERCENTAGE2!R24)","v":""}]
[{"$f":"eSPAR!A24","v":0},{"$f":"eSPAR!B24","v":0},{"$f":"IF(eSPAR!A24=\"\",\"\",PERCENTAGE2!M25)","v":""},{"$f":"IF(eSPAR!A24=\"\",\"\",PERCENTAGE2!N25)","v":""},{"$f":"IF(eSPAR!A24=\"\",\"\",PERCENTAGE2!O25)","v":""},{"$f":"IF(eSPAR!A24=\"\",\"\",PERCENTAGE2!P25)","v":""},{"$f":"IF(eSPAR!A24=\"\",\"\",PERCENTAGE2!Q25)","v":""},{"$f":"IF(eSPAR!A24=\"\",\"\",PERCENTAGE2!R25)","v":""}]
[{"$f":"eSPAR!A25","v":0},{"$f":"eSPAR!B25","v":0},{"$f":"IF(eSPAR!A25=\"\",\"\",PERCENTAGE2!M26)","v":""},{"$f":"IF(eSPAR!A25=\"\",\"\",PERCENTAGE2!N26)","v":""},{"$f":"IF(eSPAR!A25=\"\",\"\",PERCENTAGE2!O26)","v":""},{"$f":"IF(eSPAR!A25=\"\",\"\",PERCENTAGE2!P26)","v":""},{"$f":"IF(eSPAR!A25=\"\",\"\",PERCENTAGE2!Q26)","v":""},{"$f":"IF(eSPAR!A25=\"\",\"\",PERCENTAGE2!R26)","v":""}]
[{"$f":"eSPAR!A26","v":0},{"$f":"eSPAR!B26","v":0},{"$f":"IF(eSPAR!A26=\"\",\"\",PERCENTAGE2!M27)","v":""},{"$f":"IF(eSPAR!A26=\"\",\"\",PERCENTAGE2!N27)","v":""},{"$f":"IF(eSPAR!A26=\"\",\"\",PERCENTAGE2!O27)","v":""},{"$f":"IF(eSPAR!A26=\"\",\"\",PERCENTAGE2!P27)","v":""},{"$f":"IF(eSPAR!A26=\"\",\"\",PERCENTAGE2!Q27)","v":""},{"$f":"IF(eSPAR!A26=\"\",\"\",PERCENTAGE2!R27)","v":""}]
[{"$f":"eSPAR!A27","v":0},{"$f":"eSPAR!B27","v":0},{"$f":"IF(eSPAR!A27=\"\",\"\",PERCENTAGE2!M28)","v":""},{"$f":"IF(eSPAR!A27=\"\",\"\",PERCENTAGE2!N28)","v":""},{"$f":"IF(eSPAR!A27=\"\",\"\",PERCENTAGE2!O28)","v":""},{"$f":"IF(eSPAR!A27=\"\",\"\",PERCENTAGE2!P28)","v":""},{"$f":"IF(eSPAR!A27=\"\",\"\",PERCENTAGE2!Q28)","v":""},{"$f":"IF(eSPAR!A27=\"\",\"\",PERCENTAGE2!R28)","v":""}]
[{"$f":"eSPAR!A28","v":0},{"$f":"eSPAR!B28","v":0},{"$f":"IF(eSPAR!A28=\"\",\"\",PERCENTAGE2!M29)","v":""},{"$f":"IF(eSPAR!A28=\"\",\"\",PERCENTAGE2!N29)","v":""},{"$f":"IF(eSPAR!A28=\"\",\"\",PERCENTAGE2!O29)","v":""},{"$f":"IF(eSPAR!A28=\"\",\"\",PERCENTAGE2!P29)","v":""},{"$f":"IF(eSPAR!A28=\"\",\"\",PERCENTAGE2!Q29)","v":""},{"$f":"IF(eSPAR!A28=\"\",\"\",PERCENTAGE2!R29)","v":""}]
[{"$f":"eSPAR!A29","v":0},{"$f":"eSPAR!B29","v":0},{"$f":"IF(eSPAR!A29=\"\",\"\",PERCENTAGE2!M30)","v":""},{"$f":"IF(eSPAR!A29=\"\",\"\",PERCENTAGE2!N30)","v":""},{"$f":"IF(eSPAR!A29=\"\",\"\",PERCENTAGE2!O30)","v":""},{"$f":"IF(eSPAR!A29=\"\",\"\",PERCENTAGE2!P30)","v":""},{"$f":"IF(eSPAR!A29=\"\",\"\",PERCENTAGE2!Q30)","v":""},{"$f":"IF(eSPAR!A29=\"\",\"\",PERCENTAGE2!R30)","v":""}]
[{"$f":"eSPAR!A30","v":0},{"$f":"eSPAR!B30","v":0},{"$f":"IF(eSPAR!A30=\"\",\"\",PERCENTAGE2!M31)","v":""},{"$f":"IF(eSPAR!A30=\"\",\"\",PERCENTAGE2!N31)","v":""},{"$f":"IF(eSPAR!A30=\"\",\"\",PERCENTAGE2!O31)","v":""},{"$f":"IF(eSPAR!A30=\"\",\"\",PERCENTAGE2!P31)","v":""},{"$f":"IF(eSPAR!A30=\"\",\"\",PERCENTAGE2!Q31)","v":""},{"$f":"IF(eSPAR!A30=\"\",\"\",PERCENTAGE2!R31)","v":""}]
[{"$f":"eSPAR!A31","v":0},{"$f":"eSPAR!B31","v":0},{"$f":"IF(eSPAR!A31=\"\",\"\",PERCENTAGE2!M32)","v":""},{"$f":"IF(eSPAR!A31=\"\",\"\",PERCENTAGE2!N32)","v":""},{"$f":"IF(eSPAR!A31=\"\",\"\",PERCENTAGE2!O32)","v":""},{"$f":"IF(eSPAR!A31=\"\",\"\",PERCENTAGE2!P32)","v":""},{"$f":"IF(eSPAR!A31=\"\",\"\",PERCENTAGE2!Q32)","v":""},{"$f":"IF(eSPAR!A31=\"\",\"\",PERCENTAGE2!R32)","v":""}]
[{"$f":"eSPAR!A32","v":0},{"$f":"eSPAR!B32","v":0},{"$f":"IF(eSPAR!A32=\"\",\"\",PERCENTAGE2!M33)","v":""},{"$f":"IF(eSPAR!A32=\"\",\"\",PERCENTAGE2!N33)","v":""},{"$f":"IF(eSPAR!A32=\"\",\"\",PERCENTAGE2!O33)","v":""},{"$f":"IF(eSPAR!A32=\"\",\"\",PERCENTAGE2!P33)","v":""},{"$f":"IF(eSPAR!A32=\"\",\"\",PERCENTAGE2!Q33)","v":""},{"$f":"IF(eSPAR!A32=\"\",\"\",PERCENTAGE2!R33)","v":""}]
[{"$f":"eSPAR!A33","v":0},{"$f":"eSPAR!B33","v":0},{"$f":"IF(eSPAR!A33=\"\",\"\",PERCENTAGE2!M34)","v":""},{"$f":"IF(eSPAR!A33=\"\",\"\",PERCENTAGE2!N34)","v":""},{"$f":"IF(eSPAR!A33=\"\",\"\",PERCENTAGE2!O34)","v":""},{"$f":"IF(eSPAR!A33=\"\",\"\",PERCENTAGE2!P34)","v":""},{"$f":"IF(eSPAR!A33=\"\",\"\",PERCENTAGE2!Q34)","v":""},{"$f":"IF(eSPAR!A33=\"\",\"\",PERCENTAGE2!R34)","v":""}]
[{"$f":"eSPAR!A34","v":0},{"$f":"eSPAR!B34","v":0},{"$f":"IF(eSPAR!A34=\"\",\"\",PERCENTAGE2!M35)","v":""},{"$f":"IF(eSPAR!A34=\"\",\"\",PERCENTAGE2!N35)","v":""},{"$f":"IF(eSPAR!A34=\"\",\"\",PERCENTAGE2!O35)","v":""},{"$f":"IF(eSPAR!A34=\"\",\"\",PERCENTAGE2!P35)","v":""},{"$f":"IF(eSPAR!A34=\"\",\"\",PERCENTAGE2!Q35)","v":""},{"$f":"IF(eSPAR!A34=\"\",\"\",PERCENTAGE2!R35)","v":""}]
[{"$f":"eSPAR!A35","v":0},{"$f":"eSPAR!B35","v":0},{"$f":"IF(eSPAR!A35=\"\",\"\",PERCENTAGE2!M36)","v":""},{"$f":"IF(eSPAR!A35=\"\",\"\",PERCENTAGE2!N36)","v":""},{"$f":"IF(eSPAR!A35=\"\",\"\",PERCENTAGE2!O36)","v":""},{"$f":"IF(eSPAR!A35=\"\",\"\",PERCENTAGE2!P36)","v":""},{"$f":"IF(eSPAR!A35=\"\",\"\",PERCENTAGE2!Q36)","v":""},{"$f":"IF(eSPAR!A35=\"\",\"\",PERCENTAGE2!R36)","v":""}]
[{"$f":"eSPAR!A36","v":0},{"$f":"eSPAR!B36","v":0},{"$f":"IF(eSPAR!A36=\"\",\"\",PERCENTAGE2!M37)","v":""},{"$f":"IF(eSPAR!A36=\"\",\"\",PERCENTAGE2!N37)","v":""},{"$f":"IF(eSPAR!A36=\"\",\"\",PERCENTAGE2!O37)","v":""},{"$f":"IF(eSPAR!A36=\"\",\"\",PERCENTAGE2!P37)","v":""},{"$f":"IF(eSPAR!A36=\"\",\"\",PERCENTAGE2!Q37)","v":""},{"$f":"IF(eSPAR!A36=\"\",\"\",PERCENTAGE2!R37)","v":""}]
[{"$f":"eSPAR!A37","v":0},{"$f":"eSPAR!B37","v":0},{"$f":"IF(eSPAR!A37=\"\",\"\",PERCENTAGE2!M38)","v":""},{"$f":"IF(eSPAR!A37=\"\",\"\",PERCENTAGE2!N38)","v":""},{"$f":"IF(eSPAR!A37=\"\",\"\",PERCENTAGE2!O38)","v":""},{"$f":"IF(eSPAR!A37=\"\",\"\",PERCENTAGE2!P38)","v":""},{"$f":"IF(eSPAR!A37=\"\",\"\",PERCENTAGE2!Q38)","v":""},{"$f":"IF(eSPAR!A37=\"\",\"\",PERCENTAGE2!R38)","v":""}]
[{"$f":"eSPAR!A38","v":0},{"$f":"eSPAR!B38","v":0},{"$f":"IF(eSPAR!A38=\"\",\"\",PERCENTAGE2!M39)","v":""},{"$f":"IF(eSPAR!A38=\"\",\"\",PERCENTAGE2!N39)","v":""},{"$f":"IF(eSPAR!A38=\"\",\"\",PERCENTAGE2!O39)","v":""},{"$f":"IF(eSPAR!A38=\"\",\"\",PERCENTAGE2!P39)","v":""},{"$f":"IF(eSPAR!A38=\"\",\"\",PERCENTAGE2!Q39)","v":""},{"$f":"IF(eSPAR!A38=\"\",\"\",PERCENTAGE2!R39)","v":""}]
[{"$f":"eSPAR!A39","v":0},{"$f":"eSPAR!B39","v":0},{"$f":"IF(eSPAR!A39=\"\",\"\",PERCENTAGE2!M40)","v":""},{"$f":"IF(eSPAR!A39=\"\",\"\",PERCENTAGE2!N40)","v":""},{"$f":"IF(eSPAR!A39=\"\",\"\",PERCENTAGE2!O40)","v":""},{"$f":"IF(eSPAR!A39=\"\",\"\",PERCENTAGE2!P40)","v":""},{"$f":"IF(eSPAR!A39=\"\",\"\",PERCENTAGE2!Q40)","v":""},{"$f":"IF(eSPAR!A39=\"\",\"\",PERCENTAGE2!R40)","v":""}]
[{"$f":"eSPAR!A40","v":0},{"$f":"eSPAR!B40","v":0},{"$f":"IF(eSPAR!A40=\"\",\"\",PERCENTAGE2!M41)","v":""},{"$f":"IF(eSPAR!A40=\"\",\"\",PERCENTAGE2!N41)","v":""},{"$f":"IF(eSPAR!A40=\"\",\"\",PERCENTAGE2!O41)","v":""},{"$f":"IF(eSPAR!A40=\"\",\"\",PERCENTAGE2!P41)","v":""},{"$f":"IF(eSPAR!A40=\"\",\"\",PERCENTAGE2!Q41)","v":""},{"$f":"IF(eSPAR!A40=\"\",\"\",PERCENTAGE2!R41)","v":""}]
[{"$f":"eSPAR!A41","v":0},{"$f":"eSPAR!B41","v":0},{"$f":"IF(eSPAR!A41=\"\",\"\",PERCENTAGE2!M42)","v":""},{"$f":"IF(eSPAR!A41=\"\",\"\",PERCENTAGE2!N42)","v":""},{"$f":"IF(eSPAR!A41=\"\",\"\",PERCENTAGE2!O42)","v":""},{"$f":"IF(eSPAR!A41=\"\",\"\",PERCENTAGE2!P42)","v":""},{"$f":"IF(eSPAR!A41=\"\",\"\",PERCENTAGE2!Q42)","v":""},{"$f":"IF(eSPAR!A41=\"\",\"\",PERCENTAGE2!R42)","v":""}]
[{"$f":"eSPAR!A42","v":0},{"$f":"eSPAR!B42","v":0},{"$f":"IF(eSPAR!A42=\"\",\"\",PERCENTAGE2!M43)","v":""},{"$f":"IF(eSPAR!A42=\"\",\"\",PERCENTAGE2!N43)","v":""},{"$f":"IF(eSPAR!A42=\"\",\"\",PERCENTAGE2!O43)","v":""},{"$f":"IF(eSPAR!A42=\"\",\"\",PERCENTAGE2!P43)","v":""},{"$f":"IF(eSPAR!A42=\"\",\"\",PERCENTAGE2!Q43)","v":""},{"$f":"IF(eSPAR!A42=\"\",\"\",PERCENTAGE2!R43)","v":""}]
[{"$f":"eSPAR!A43","v":0},{"$f":"eSPAR!B43","v":0},{"$f":"IF(eSPAR!A43=\"\",\"\",PERCENTAGE2!M44)","v":""},{"$f":"IF(eSPAR!A43=\"\",\"\",PERCENTAGE2!N44)","v":""},{"$f":"IF(eSPAR!A43=\"\",\"\",PERCENTAGE2!O44)","v":""},{"$f":"IF(eSPAR!A43=\"\",\"\",PERCENTAGE2!P44)","v":""},{"$f":"IF(eSPAR!A43=\"\",\"\",PERCENTAGE2!Q44)","v":""},{"$f":"IF(eSPAR!A43=\"\",\"\",PERCENTAGE2!R44)","v":""}]
[{"$f":"eSPAR!A44","v":0},{"$f":"eSPAR!B44","v":0},{"$f":"IF(eSPAR!A44=\"\",\"\",PERCENTAGE2!M45)","v":""},{"$f":"IF(eSPAR!A44=\"\",\"\",PERCENTAGE2!N45)","v":""},{"$f":"IF(eSPAR!A44=\"\",\"\",PERCENTAGE2!O45)","v":""},{"$f":"IF(eSPAR!A44=\"\",\"\",PERCENTAGE2!P45)","v":""},{"$f":"IF(eSPAR!A44=\"\",\"\",PERCENTAGE2!Q45)","v":""},{"$f":"IF(eSPAR!A44=\"\",\"\",PERCENTAGE2!R45)","v":""}]
[{"$f":"eSPAR!A45","v":0},{"$f":"eSPAR!B45","v":0},{"$f":"IF(eSPAR!A45=\"\",\"\",PERCENTAGE2!M46)","v":""},{"$f":"IF(eSPAR!A45=\"\",\"\",PERCENTAGE2!N46)","v":""},{"$f":"IF(eSPAR!A45=\"\",\"\",PERCENTAGE2!O46)","v":""},{"$f":"IF(eSPAR!A45=\"\",\"\",PERCENTAGE2!P46)","v":""},{"$f":"IF(eSPAR!A45=\"\",\"\",PERCENTAGE2!Q46)","v":""},{"$f":"IF(eSPAR!A45=\"\",\"\",PERCENTAGE2!R46)","v":""}]
[{"$f":"eSPAR!A46","v":0},{"$f":"eSPAR!B46","v":0},{"$f":"IF(eSPAR!A46=\"\",\"\",PERCENTAGE2!M47)","v":""},{"$f":"IF(eSPAR!A46=\"\",\"\",PERCENTAGE2!N47)","v":""},{"$f":"IF(eSPAR!A46=\"\",\"\",PERCENTAGE2!O47)","v":""},{"$f":"IF(eSPAR!A46=\"\",\"\",PERCENTAGE2!P47)","v":""},{"$f":"IF(eSPAR!A46=\"\",\"\",PERCENTAGE2!Q47)","v":""},{"$f":"IF(eSPAR!A46=\"\",\"\",PERCENTAGE2!R47)","v":""}]
[{"$f":"eSPAR!A47","v":0},{"$f":"eSPAR!B47","v":0},{"$f":"IF(eSPAR!A47=\"\",\"\",PERCENTAGE2!M48)","v":""},{"$f":"IF(eSPAR!A47=\"\",\"\",PERCENTAGE2!N48)","v":""},{"$f":"IF(eSPAR!A47=\"\",\"\",PERCENTAGE2!O48)","v":""},{"$f":"IF(eSPAR!A47=\"\",\"\",PERCENTAGE2!P48)","v":""},{"$f":"IF(eSPAR!A47=\"\",\"\",PERCENTAGE2!Q48)","v":""},{"$f":"IF(eSPAR!A47=\"\",\"\",PERCENTAGE2!R48)","v":""}]
[{"$f":"eSPAR!A48","v":0},{"$f":"eSPAR!B48","v":0},{"$f":"IF(eSPAR!A48=\"\",\"\",PERCENTAGE2!M49)","v":""},{"$f":"IF(eSPAR!A48=\"\",\"\",PERCENTAGE2!N49)","v":""},{"$f":"IF(eSPAR!A48=\"\",\"\",PERCENTAGE2!O49)","v":""},{"$f":"IF(eSPAR!A48=\"\",\"\",PERCENTAGE2!P49)","v":""},{"$f":"IF(eSPAR!A48=\"\",\"\",PERCENTAGE2!Q49)","v":""},{"$f":"IF(eSPAR!A48=\"\",\"\",PERCENTAGE2!R49)","v":""}]
[{"$f":"eSPAR!A49","v":0},{"$f":"eSPAR!B49","v":0},{"$f":"IF(eSPAR!A49=\"\",\"\",PERCENTAGE2!M50)","v":""},{"$f":"IF(eSPAR!A49=\"\",\"\",PERCENTAGE2!N50)","v":""},{"$f":"IF(eSPAR!A49=\"\",\"\",PERCENTAGE2!O50)","v":""},{"$f":"IF(eSPAR!A49=\"\",\"\",PERCENTAGE2!P50)","v":""},{"$f":"IF(eSPAR!A49=\"\",\"\",PERCENTAGE2!Q50)","v":""},{"$f":"IF(eSPAR!A49=\"\",\"\",PERCENTAGE2!R50)","v":""}]
[{"$f":"eSPAR!A50","v":0},{"$f":"eSPAR!B50","v":0},{"$f":"IF(eSPAR!A50=\"\",\"\",PERCENTAGE2!M51)","v":""},{"$f":"IF(eSPAR!A50=\"\",\"\",PERCENTAGE2!N51)","v":""},{"$f":"IF(eSPAR!A50=\"\",\"\",PERCENTAGE2!O51)","v":""},{"$f":"IF(eSPAR!A50=\"\",\"\",PERCENTAGE2!P51)","v":""},{"$f":"IF(eSPAR!A50=\"\",\"\",PERCENTAGE2!Q51)","v":""},{"$f":"IF(eSPAR!A50=\"\",\"\",PERCENTAGE2!R51)","v":""}]
[{"$f":"eSPAR!A51","v":0},{"$f":"eSPAR!B51","v":0},{"$f":"IF(eSPAR!A51=\"\",\"\",PERCENTAGE2!M52)","v":""},{"$f":"IF(eSPAR!A51=\"\",\"\",PERCENTAGE2!N52)","v":""},{"$f":"IF(eSPAR!A51=\"\",\"\",PERCENTAGE2!O52)","v":""},{"$f":"IF(eSPAR!A51=\"\",\"\",PERCENTAGE2!P52)","v":""},{"$f":"IF(eSPAR!A51=\"\",\"\",PERCENTAGE2!Q52)","v":""},{"$f":"IF(eSPAR!A51=\"\",\"\",PERCENTAGE2!R52)","v":""}]
[{"$f":"eSPAR!A52","v":0},{"$f":"eSPAR!B52","v":0},{"$f":"IF(eSPAR!A52=\"\",\"\",PERCENTAGE2!M53)","v":""},{"$f":"IF(eSPAR!A52=\"\",\"\",PERCENTAGE2!N53)","v":""},{"$f":"IF(eSPAR!A52=\"\",\"\",PERCENTAGE2!O53)","v":""},{"$f":"IF(eSPAR!A52=\"\",\"\",PERCENTAGE2!P53)","v":""},{"$f":"IF(eSPAR!A52=\"\",\"\",PERCENTAGE2!Q53)","v":""},{"$f":"IF(eSPAR!A52=\"\",\"\",PERCENTAGE2!R53)","v":""}]
[{"$f":"eSPAR!A53","v":0},{"$f":"eSPAR!B53","v":0},{"$f":"IF(eSPAR!A53=\"\",\"\",PERCENTAGE2!M54)","v":""},{"$f":"IF(eSPAR!A53=\"\",\"\",PERCENTAGE2!N54)","v":""},{"$f":"IF(eSPAR!A53=\"\",\"\",PERCENTAGE2!O54)","v":""},{"$f":"IF(eSPAR!A53=\"\",\"\",PERCENTAGE2!P54)","v":""},{"$f":"IF(eSPAR!A53=\"\",\"\",PERCENTAGE2!Q54)","v":""},{"$f":"IF(eSPAR!A53=\"\",\"\",PERCENTAGE2!R54)","v":""}]
[{"$f":"eSPAR!A54","v":0},{"$f":"eSPAR!B54","v":0},{"$f":"IF(eSPAR!A54=\"\",\"\",PERCENTAGE2!M55)","v":""},{"$f":"IF(eSPAR!A54=\"\",\"\",PERCENTAGE2!N55)","v":""},{"$f":"IF(eSPAR!A54=\"\",\"\",PERCENTAGE2!O55)","v":""},{"$f":"IF(eSPAR!A54=\"\",\"\",PERCENTAGE2!P55)","v":""},{"$f":"IF(eSPAR!A54=\"\",\"\",PERCENTAGE2!Q55)","v":""},{"$f":"IF(eSPAR!A54=\"\",\"\",PERCENTAGE2!R55)","v":""}]
[{"$f":"eSPAR!A55","v":0},{"$f":"eSPAR!B55","v":0},{"$f":"IF(eSPAR!A55=\"\",\"\",PERCENTAGE2!M56)","v":""},{"$f":"IF(eSPAR!A55=\"\",\"\",PERCENTAGE2!N56)","v":""},{"$f":"IF(eSPAR!A55=\"\",\"\",PERCENTAGE2!O56)","v":""},{"$f":"IF(eSPAR!A55=\"\",\"\",PERCENTAGE2!P56)","v":""},{"$f":"IF(eSPAR!A55=\"\",\"\",PERCENTAGE2!Q56)","v":""},{"$f":"IF(eSPAR!A55=\"\",\"\",PERCENTAGE2!R56)","v":""}]
[{"$f":"eSPAR!A56","v":0},{"$f":"eSPAR!B56","v":0},{"$f":"IF(eSPAR!A56=\"\",\"\",PERCENTAGE2!M57)","v":""},{"$f":"IF(eSPAR!A56=\"\",\"\",PERCENTAGE2!N57)","v":""},{"$f":"IF(eSPAR!A56=\"\",\"\",PERCENTAGE2!O57)","v":""},{"$f":"IF(eSPAR!A56=\"\",\"\",PERCENTAGE2!P57)","v":""},{"$f":"IF(eSPAR!A56=\"\",\"\",PERCENTAGE2!Q57)","v":""},{"$f":"IF(eSPAR!A56=\"\",\"\",PERCENTAGE2!R57)","v":""}]
[{"$f":"eSPAR!A57","v":0},{"$f":"eSPAR!B57","v":0},{"$f":"IF(eSPAR!A57=\"\",\"\",PERCENTAGE2!M58)","v":""},{"$f":"IF(eSPAR!A57=\"\",\"\",PERCENTAGE2!N58)","v":""},{"$f":"IF(eSPAR!A57=\"\",\"\",PERCENTAGE2!O58)","v":""},{"$f":"IF(eSPAR!A57=\"\",\"\",PERCENTAGE2!P58)","v":""},{"$f":"IF(eSPAR!A57=\"\",\"\",PERCENTAGE2!Q58)","v":""},{"$f":"IF(eSPAR!A57=\"\",\"\",PERCENTAGE2!R58)","v":""}]
[{"$f":"eSPAR!A58","v":0},{"$f":"eSPAR!B58","v":0},{"$f":"IF(eSPAR!A58=\"\",\"\",PERCENTAGE2!M59)","v":""},{"$f":"IF(eSPAR!A58=\"\",\"\",PERCENTAGE2!N59)","v":""},{"$f":"IF(eSPAR!A58=\"\",\"\",PERCENTAGE2!O59)","v":""},{"$f":"IF(eSPAR!A58=\"\",\"\",PERCENTAGE2!P59)","v":""},{"$f":"IF(eSPAR!A58=\"\",\"\",PERCENTAGE2!Q59)","v":""},{"$f":"IF(eSPAR!A58=\"\",\"\",PERCENTAGE2!R59)","v":""}]
[{"$f":"eSPAR!A59","v":0},{"$f":"eSPAR!B59","v":0},{"$f":"IF(eSPAR!A59=\"\",\"\",PERCENTAGE2!M60)","v":""},{"$f":"IF(eSPAR!A59=\"\",\"\",PERCENTAGE2!N60)","v":""},{"$f":"IF(eSPAR!A59=\"\",\"\",PERCENTAGE2!O60)","v":""},{"$f":"IF(eSPAR!A59=\"\",\"\",PERCENTAGE2!P60)","v":""},{"$f":"IF(eSPAR!A59=\"\",\"\",PERCENTAGE2!Q60)","v":""},{"$f":"IF(eSPAR!A59=\"\",\"\",PERCENTAGE2!R60)","v":""}]
[{"$f":"eSPAR!A60","v":0},{"$f":"eSPAR!B60","v":0},{"$f":"IF(eSPAR!A60=\"\",\"\",PERCENTAGE2!M61)","v":""},{"$f":"IF(eSPAR!A60=\"\",\"\",PERCENTAGE2!N61)","v":""},{"$f":"IF(eSPAR!A60=\"\",\"\",PERCENTAGE2!O61)","v":""},{"$f":"IF(eSPAR!A60=\"\",\"\",PERCENTAGE2!P61)","v":""},{"$f":"IF(eSPAR!A60=\"\",\"\",PERCENTAGE2!Q61)","v":""},{"$f":"IF(eSPAR!A60=\"\",\"\",PERCENTAGE2!R61)","v":""}]
[{"$f":"eSPAR!A61","v":0},{"$f":"eSPAR!B61","v":0},{"$f":"IF(eSPAR!A61=\"\",\"\",PERCENTAGE2!M62)","v":""},{"$f":"IF(eSPAR!A61=\"\",\"\",PERCENTAGE2!N62)","v":""},{"$f":"IF(eSPAR!A61=\"\",\"\",PERCENTAGE2!O62)","v":""},{"$f":"IF(eSPAR!A61=\"\",\"\",PERCENTAGE2!P62)","v":""},{"$f":"IF(eSPAR!A61=\"\",\"\",PERCENTAGE2!Q62)","v":""},{"$f":"IF(eSPAR!A61=\"\",\"\",PERCENTAGE2!R62)","v":""}]
[{"$f":"eSPAR!A62","v":0},{"$f":"eSPAR!B62","v":0},{"$f":"IF(eSPAR!A62=\"\",\"\",PERCENTAGE2!M63)","v":""},{"$f":"IF(eSPAR!A62=\"\",\"\",PERCENTAGE2!N63)","v":""},{"$f":"IF(eSPAR!A62=\"\",\"\",PERCENTAGE2!O63)","v":""},{"$f":"IF(eSPAR!A62=\"\",\"\",PERCENTAGE2!P63)","v":""},{"$f":"IF(eSPAR!A62=\"\",\"\",PERCENTAGE2!Q63)","v":""},{"$f":"IF(eSPAR!A62=\"\",\"\",PERCENTAGE2!R63)","v":""}]
[{"$f":"eSPAR!A63","v":0},{"$f":"eSPAR!B63","v":0},{"$f":"IF(eSPAR!A63=\"\",\"\",PERCENTAGE2!M64)","v":""},{"$f":"IF(eSPAR!A63=\"\",\"\",PERCENTAGE2!N64)","v":""},{"$f":"IF(eSPAR!A63=\"\",\"\",PERCENTAGE2!O64)","v":""},{"$f":"IF(eSPAR!A63=\"\",\"\",PERCENTAGE2!P64)","v":""},{"$f":"IF(eSPAR!A63=\"\",\"\",PERCENTAGE2!Q64)","v":""},{"$f":"IF(eSPAR!A63=\"\",\"\",PERCENTAGE2!R64)","v":""}]
[{"$f":"eSPAR!A64","v":0},{"$f":"eSPAR!B64","v":0},{"$f":"IF(eSPAR!A64=\"\",\"\",PERCENTAGE2!M65)","v":""},{"$f":"IF(eSPAR!A64=\"\",\"\",PERCENTAGE2!N65)","v":""},{"$f":"IF(eSPAR!A64=\"\",\"\",PERCENTAGE2!O65)","v":""},{"$f":"IF(eSPAR!A64=\"\",\"\",PERCENTAGE2!P65)","v":""},{"$f":"IF(eSPAR!A64=\"\",\"\",PERCENTAGE2!Q65)","v":""},{"$f":"IF(eSPAR!A64=\"\",\"\",PERCENTAGE2!R65)","v":""}]
[{"$f":"eSPAR!A65","v":0},{"$f":"eSPAR!B65","v":0},{"$f":"IF(eSPAR!A65=\"\",\"\",PERCENTAGE2!M66)","v":""},{"$f":"IF(eSPAR!A65=\"\",\"\",PERCENTAGE2!N66)","v":""},{"$f":"IF(eSPAR!A65=\"\",\"\",PERCENTAGE2!O66)","v":""},{"$f":"IF(eSPAR!A65=\"\",\"\",PERCENTAGE2!P66)","v":""},{"$f":"IF(eSPAR!A65=\"\",\"\",PERCENTAGE2!Q66)","v":""},{"$f":"IF(eSPAR!A65=\"\",\"\",PERCENTAGE2!R66)","v":""}]
[{"$f":"eSPAR!A66","v":0},{"$f":"eSPAR!B66","v":0},{"$f":"IF(eSPAR!A66=\"\",\"\",PERCENTAGE2!M67)","v":""},{"$f":"IF(eSPAR!A66=\"\",\"\",PERCENTAGE2!N67)","v":""},{"$f":"IF(eSPAR!A66=\"\",\"\",PERCENTAGE2!O67)","v":""},{"$f":"IF(eSPAR!A66=\"\",\"\",PERCENTAGE2!P67)","v":""},{"$f":"IF(eSPAR!A66=\"\",\"\",PERCENTAGE2!Q67)","v":""},{"$f":"IF(eSPAR!A66=\"\",\"\",PERCENTAGE2!R67)","v":""}]
[{"$f":"eSPAR!A67","v":0},{"$f":"eSPAR!B67","v":0},{"$f":"IF(eSPAR!A67=\"\",\"\",PERCENTAGE2!M68)","v":""},{"$f":"IF(eSPAR!A67=\"\",\"\",PERCENTAGE2!N68)","v":""},{"$f":"IF(eSPAR!A67=\"\",\"\",PERCENTAGE2!O68)","v":""},{"$f":"IF(eSPAR!A67=\"\",\"\",PERCENTAGE2!P68)","v":""},{"$f":"IF(eSPAR!A67=\"\",\"\",PERCENTAGE2!Q68)","v":""},{"$f":"IF(eSPAR!A67=\"\",\"\",PERCENTAGE2!R68)","v":""}]
[{"$f":"eSPAR!A68","v":0},{"$f":"eSPAR!B68","v":0},{"$f":"IF(eSPAR!A68=\"\",\"\",PERCENTAGE2!M69)","v":""},{"$f":"IF(eSPAR!A68=\"\",\"\",PERCENTAGE2!N69)","v":""},{"$f":"IF(eSPAR!A68=\"\",\"\",PERCENTAGE2!O69)","v":""},{"$f":"IF(eSPAR!A68=\"\",\"\",PERCENTAGE2!P69)","v":""},{"$f":"IF(eSPAR!A68=\"\",\"\",PERCENTAGE2!Q69)","v":""},{"$f":"IF(eSPAR!A68=\"\",\"\",PERCENTAGE2!R69)","v":""}]
[{"$f":"eSPAR!A69","v":0},{"$f":"eSPAR!B69","v":0},{"$f":"IF(eSPAR!A69=\"\",\"\",PERCENTAGE2!M70)","v":""},{"$f":"IF(eSPAR!A69=\"\",\"\",PERCENTAGE2!N70)","v":""},{"$f":"IF(eSPAR!A69=\"\",\"\",PERCENTAGE2!O70)","v":""},{"$f":"IF(eSPAR!A69=\"\",\"\",PERCENTAGE2!P70)","v":""},{"$f":"IF(eSPAR!A69=\"\",\"\",PERCENTAGE2!Q70)","v":""},{"$f":"IF(eSPAR!A69=\"\",\"\",PERCENTAGE2!R70)","v":""}]
[{"$f":"eSPAR!A70","v":0},{"$f":"eSPAR!B70","v":0},{"$f":"IF(eSPAR!A70=\"\",\"\",PERCENTAGE2!M71)","v":""},{"$f":"IF(eSPAR!A70=\"\",\"\",PERCENTAGE2!N71)","v":""},{"$f":"IF(eSPAR!A70=\"\",\"\",PERCENTAGE2!O71)","v":""},{"$f":"IF(eSPAR!A70=\"\",\"\",PERCENTAGE2!P71)","v":""},{"$f":"IF(eSPAR!A70=\"\",\"\",PERCENTAGE2!Q71)","v":""},{"$f":"IF(eSPAR!A70=\"\",\"\",PERCENTAGE2!R71)","v":""}]
[{"$f":"eSPAR!A71","v":0},{"$f":"eSPAR!B71","v":0},{"$f":"IF(eSPAR!A71=\"\",\"\",PERCENTAGE2!M72)","v":""},{"$f":"IF(eSPAR!A71=\"\",\"\",PERCENTAGE2!N72)","v":""},{"$f":"IF(eSPAR!A71=\"\",\"\",PERCENTAGE2!O72)","v":""},{"$f":"IF(eSPAR!A71=\"\",\"\",PERCENTAGE2!P72)","v":""},{"$f":"IF(eSPAR!A71=\"\",\"\",PERCENTAGE2!Q72)","v":""},{"$f":"IF(eSPAR!A71=\"\",\"\",PERCENTAGE2!R72)","v":""}]
[{"$f":"eSPAR!A72","v":0},{"$f":"eSPAR!B72","v":0},{"$f":"IF(eSPAR!A72=\"\",\"\",PERCENTAGE2!M73)","v":""},{"$f":"IF(eSPAR!A72=\"\",\"\",PERCENTAGE2!N73)","v":""},{"$f":"IF(eSPAR!A72=\"\",\"\",PERCENTAGE2!O73)","v":""},{"$f":"IF(eSPAR!A72=\"\",\"\",PERCENTAGE2!P73)","v":""},{"$f":"IF(eSPAR!A72=\"\",\"\",PERCENTAGE2!Q73)","v":""},{"$f":"IF(eSPAR!A72=\"\",\"\",PERCENTAGE2!R73)","v":""}]
[{"$f":"eSPAR!A73","v":0},{"$f":"eSPAR!B73","v":0},{"$f":"IF(eSPAR!A73=\"\",\"\",PERCENTAGE2!M74)","v":""},{"$f":"IF(eSPAR!A73=\"\",\"\",PERCENTAGE2!N74)","v":""},{"$f":"IF(eSPAR!A73=\"\",\"\",PERCENTAGE2!O74)","v":""},{"$f":"IF(eSPAR!A73=\"\",\"\",PERCENTAGE2!P74)","v":""},{"$f":"IF(eSPAR!A73=\"\",\"\",PERCENTAGE2!Q74)","v":""},{"$f":"IF(eSPAR!A73=\"\",\"\",PERCENTAGE2!R74)","v":""}]
[{"$f":"eSPAR!A74","v":0},{"$f":"eSPAR!B74","v":0},{"$f":"IF(eSPAR!A74=\"\",\"\",PERCENTAGE2!M75)","v":""},{"$f":"IF(eSPAR!A74=\"\",\"\",PERCENTAGE2!N75)","v":""},{"$f":"IF(eSPAR!A74=\"\",\"\",PERCENTAGE2!O75)","v":""},{"$f":"IF(eSPAR!A74=\"\",\"\",PERCENTAGE2!P75)","v":""},{"$f":"IF(eSPAR!A74=\"\",\"\",PERCENTAGE2!Q75)","v":""},{"$f":"IF(eSPAR!A74=\"\",\"\",PERCENTAGE2!R75)","v":""}]
[{"$f":"eSPAR!A75","v":0},{"$f":"eSPAR!B75","v":0},{"$f":"IF(eSPAR!A75=\"\",\"\",PERCENTAGE2!M76)","v":""},{"$f":"IF(eSPAR!A75=\"\",\"\",PERCENTAGE2!N76)","v":""},{"$f":"IF(eSPAR!A75=\"\",\"\",PERCENTAGE2!O76)","v":""},{"$f":"IF(eSPAR!A75=\"\",\"\",PERCENTAGE2!P76)","v":""},{"$f":"IF(eSPAR!A75=\"\",\"\",PERCENTAGE2!Q76)","v":""},{"$f":"IF(eSPAR!A75=\"\",\"\",PERCENTAGE2!R76)","v":""}]
[{"$f":"eSPAR!A76","v":0},{"$f":"eSPAR!B76","v":0},{"$f":"IF(eSPAR!A76=\"\",\"\",PERCENTAGE2!M77)","v":""},{"$f":"IF(eSPAR!A76=\"\",\"\",PERCENTAGE2!N77)","v":""},{"$f":"IF(eSPAR!A76=\"\",\"\",PERCENTAGE2!O77)","v":""},{"$f":"IF(eSPAR!A76=\"\",\"\",PERCENTAGE2!P77)","v":""},{"$f":"IF(eSPAR!A76=\"\",\"\",PERCENTAGE2!Q77)","v":""},{"$f":"IF(eSPAR!A76=\"\",\"\",PERCENTAGE2!R77)","v":""}]
[{"$f":"eSPAR!A77","v":0},{"$f":"eSPAR!B77","v":0},{"$f":"IF(eSPAR!A77=\"\",\"\",PERCENTAGE2!M78)","v":""},{"$f":"IF(eSPAR!A77=\"\",\"\",PERCENTAGE2!N78)","v":""},{"$f":"IF(eSPAR!A77=\"\",\"\",PERCENTAGE2!O78)","v":""},{"$f":"IF(eSPAR!A77=\"\",\"\",PERCENTAGE2!P78)","v":""},{"$f":"IF(eSPAR!A77=\"\",\"\",PERCENTAGE2!Q78)","v":""},{"$f":"IF(eSPAR!A77=\"\",\"\",PERCENTAGE2!R78)","v":""}]
[{"$f":"eSPAR!A78","v":0},{"$f":"eSPAR!B78","v":0},{"$f":"IF(eSPAR!A78=\"\",\"\",PERCENTAGE2!M79)","v":""},{"$f":"IF(eSPAR!A78=\"\",\"\",PERCENTAGE2!N79)","v":""},{"$f":"IF(eSPAR!A78=\"\",\"\",PERCENTAGE2!O79)","v":""},{"$f":"IF(eSPAR!A78=\"\",\"\",PERCENTAGE2!P79)","v":""},{"$f":"IF(eSPAR!A78=\"\",\"\",PERCENTAGE2!Q79)","v":""},{"$f":"IF(eSPAR!A78=\"\",\"\",PERCENTAGE2!R79)","v":""}]
[{"$f":"eSPAR!A79","v":0},{"$f":"eSPAR!B79","v":0},{"$f":"IF(eSPAR!A79=\"\",\"\",PERCENTAGE2!M80)","v":""},{"$f":"IF(eSPAR!A79=\"\",\"\",PERCENTAGE2!N80)","v":""},{"$f":"IF(eSPAR!A79=\"\",\"\",PERCENTAGE2!O80)","v":""},{"$f":"IF(eSPAR!A79=\"\",\"\",PERCENTAGE2!P80)","v":""},{"$f":"IF(eSPAR!A79=\"\",\"\",PERCENTAGE2!Q80)","v":""},{"$f":"IF(eSPAR!A79=\"\",\"\",PERCENTAGE2!R80)","v":""}]
[{"$f":"eSPAR!A80","v":0},{"$f":"eSPAR!B80","v":0},{"$f":"IF(eSPAR!A80=\"\",\"\",PERCENTAGE2!M81)","v":""},{"$f":"IF(eSPAR!A80=\"\",\"\",PERCENTAGE2!N81)","v":""},{"$f":"IF(eSPAR!A80=\"\",\"\",PERCENTAGE2!O81)","v":""},{"$f":"IF(eSPAR!A80=\"\",\"\",PERCENTAGE2!P81)","v":""},{"$f":"IF(eSPAR!A80=\"\",\"\",PERCENTAGE2!Q81)","v":""},{"$f":"IF(eSPAR!A80=\"\",\"\",PERCENTAGE2!R81)","v":""}]
[{"$f":"eSPAR!A81","v":0},{"$f":"eSPAR!B81","v":0},{"$f":"IF(eSPAR!A81=\"\",\"\",PERCENTAGE2!M82)","v":""},{"$f":"IF(eSPAR!A81=\"\",\"\",PERCENTAGE2!N82)","v":""},{"$f":"IF(eSPAR!A81=\"\",\"\",PERCENTAGE2!O82)","v":""},{"$f":"IF(eSPAR!A81=\"\",\"\",PERCENTAGE2!P82)","v":""},{"$f":"IF(eSPAR!A81=\"\",\"\",PERCENTAGE2!Q82)","v":""},{"$f":"IF(eSPAR!A81=\"\",\"\",PERCENTAGE2!R82)","v":""}]
[{"$f":"eSPAR!A82","v":0},{"$f":"eSPAR!B82","v":0},{"$f":"IF(eSPAR!A82=\"\",\"\",PERCENTAGE2!M83)","v":""},{"$f":"IF(eSPAR!A82=\"\",\"\",PERCENTAGE2!N83)","v":""},{"$f":"IF(eSPAR!A82=\"\",\"\",PERCENTAGE2!O83)","v":""},{"$f":"IF(eSPAR!A82=\"\",\"\",PERCENTAGE2!P83)","v":""},{"$f":"IF(eSPAR!A82=\"\",\"\",PERCENTAGE2!Q83)","v":""},{"$f":"IF(eSPAR!A82=\"\",\"\",PERCENTAGE2!R83)","v":""}]
[{"$f":"eSPAR!A83","v":0},{"$f":"eSPAR!B83","v":0},{"$f":"IF(eSPAR!A83=\"\",\"\",PERCENTAGE2!M84)","v":""},{"$f":"IF(eSPAR!A83=\"\",\"\",PERCENTAGE2!N84)","v":""},{"$f":"IF(eSPAR!A83=\"\",\"\",PERCENTAGE2!O84)","v":""},{"$f":"IF(eSPAR!A83=\"\",\"\",PERCENTAGE2!P84)","v":""},{"$f":"IF(eSPAR!A83=\"\",\"\",PERCENTAGE2!Q84)","v":""},{"$f":"IF(eSPAR!A83=\"\",\"\",PERCENTAGE2!R84)","v":""}]
[{"$f":"eSPAR!A84","v":0},{"$f":"eSPAR!B84","v":0},{"$f":"IF(eSPAR!A84=\"\",\"\",PERCENTAGE2!M85)","v":""},{"$f":"IF(eSPAR!A84=\"\",\"\",PERCENTAGE2!N85)","v":""},{"$f":"IF(eSPAR!A84=\"\",\"\",PERCENTAGE2!O85)","v":""},{"$f":"IF(eSPAR!A84=\"\",\"\",PERCENTAGE2!P85)","v":""},{"$f":"IF(eSPAR!A84=\"\",\"\",PERCENTAGE2!Q85)","v":""},{"$f":"IF(eSPAR!A84=\"\",\"\",PERCENTAGE2!R85)","v":""}]
[{"$f":"eSPAR!A85","v":0},{"$f":"eSPAR!B85","v":0},{"$f":"IF(eSPAR!A85=\"\",\"\",PERCENTAGE2!M86)","v":""},{"$f":"IF(eSPAR!A85=\"\",\"\",PERCENTAGE2!N86)","v":""},{"$f":"IF(eSPAR!A85=\"\",\"\",PERCENTAGE2!O86)","v":""},{"$f":"IF(eSPAR!A85=\"\",\"\",PERCENTAGE2!P86)","v":""},{"$f":"IF(eSPAR!A85=\"\",\"\",PERCENTAGE2!Q86)","v":""},{"$f":"IF(eSPAR!A85=\"\",\"\",PERCENTAGE2!R86)","v":""}]

{"sheet":"pPT3-H","index":17,"n_rows":86,"n_cols":8,"rows_kept":86,"cut":false,"hidden":true,"merged":[[3,7,4,7],[0,0,0,7],[1,0,1,7],[2,0,2,7],[3,0,5,0],[3,1,4,1],[3,2,4,2],[3,3,4,3],[3,4,4,4],[3,5,4,5],[3,6,4,6]]}
[{"$f":"Internal!C25","v":"Golden Valley School"}]
[{"$f":"Internal!B34","v":"Class : IX"}]
[{"$f":"\"Periodic Test 3 (\"&Internal!B33&\")\"","v":"Periodic Test 3 (Academic Session: 2017-18)"}]
["Roll No.","Name",{"$f":"eSUBMAR!B6","v":"English"},{"$f":"eSUBMAR!B7","v":"Hindi"},{"$f":"eSUBMAR!B8","v":"Mathematics"},{"$f":"eSUBMAR!B9","v":"Science"},{"$f":"eSUBMAR!B10","v":"Social Studies"},{"$f":"eSUBMAR!B11","v":"I.T."}]
[]
[null,"Max. Marks>>",10,10,10,10,10,10]
[{"$f":"eSPAR!A6","v":1},{"$f":"eSPAR!B6","v":"Aman Kumar"},{"$f":"IF(eSPAR!A6=\"\",\"\",PERCENTAGE2!W7)","v":7},{"$f":"IF(eSPAR!A6=\"\",\"\",PERCENTAGE2!X7)","v":8},{"$f":"IF(eSPAR!A6=\"\",\"\",PERCENTAGE2!Y7)","v":9},{"$f":"IF(eSPAR!A6=\"\",\"\",PERCENTAGE2!Z7)","v":6},{"$f":"IF(eSPAR!A6=\"\",\"\",PERCENTAGE2!AA7)","v":7},{"$f":"IF(eSPAR!A6=\"\",\"\",PERCENTAGE2!AB7)","v":8}]
[{"$f":"eSPAR!A7","v":2},{"$f":"eSPAR!B7","v":0},{"$f":"IF(eSPAR!A7=\"\",\"\",PERCENTAGE2!W8)","v":0},{"$f":"IF(eSPAR!A7=\"\",\"\",PERCENTAGE2!X8)","v":0},{"$f":"IF(eSPAR!A7=\"\",\"\",PERCENTAGE2!Y8)","v":0},{"$f":"IF(eSPAR!A7=\"\",\"\",PERCENTAGE2!Z8)","v":0},{"$f":"IF(eSPAR!A7=\"\",\"\",PERCENTAGE2!AA8)","v":0},{"$f":"IF(eSPAR!A7=\"\",\"\",PERCENTAGE2!AB8)","v":0}]
[{"$f":"eSPAR!A8","v":0},{"$f":"eSPAR!B8","v":0},{"$f":"IF(eSPAR!A8=\"\",\"\",PERCENTAGE2!W9)","v":""},{"$f":"IF(eSPAR!A8=\"\",\"\",PERCENTAGE2!X9)","v":""},{"$f":"IF(eSPAR!A8=\"\",\"\",PERCENTAGE2!Y9)","v":""},{"$f":"IF(eSPAR!A8=\"\",\"\",PERCENTAGE2!Z9)","v":""},{"$f":"IF(eSPAR!A8=\"\",\"\",PERCENTAGE2!AA9)","v":""},{"$f":"IF(eSPAR!A8=\"\",\"\",PERCENTAGE2!AB9)","v":""}]
[{"$f":"eSPAR!A9","v":0},{"$f":"eSPAR!B9","v":0},{"$f":"IF(eSPAR!A9=\"\",\"\",PERCENTAGE2!W10)","v":""},{"$f":"IF(eSPAR!A9=\"\",\"\",PERCENTAGE2!X10)","v":""},{"$f":"IF(eSPAR!A9=\"\",\"\",PERCENTAGE2!Y10)","v":""},{"$f":"IF(eSPAR!A9=\"\",\"\",PERCENTAGE2!Z10)","v":""},{"$f":"IF(eSPAR!A9=\"\",\"\",PERCENTAGE2!AA10)","v":""},{"$f":"IF(eSPAR!A9=\"\",\"\",PERCENTAGE2!AB10)","v":""}]
[{"$f":"eSPAR!A10","v":0},{"$f":"eSPAR!B10","v":0},{"$f":"IF(eSPAR!A10=\"\",\"\",PERCENTAGE2!W11)","v":""},{"$f":"IF(eSPAR!A10=\"\",\"\",PERCENTAGE2!X11)","v":""},{"$f":"IF(eSPAR!A10=\"\",\"\",PERCENTAGE2!Y11)","v":""},{"$f":"IF(eSPAR!A10=\"\",\"\",PERCENTAGE2!Z11)","v":""},{"$f":"IF(eSPAR!A10=\"\",\"\",PERCENTAGE2!AA11)","v":""},{"$f":"IF(eSPAR!A10=\"\",\"\",PERCENTAGE2!AB11)","v":""}]
[{"$f":"eSPAR!A11","v":0},{"$f":"eSPAR!B11","v":0},{"$f":"IF(eSPAR!A11=\"\",\"\",PERCENTAGE2!W12)","v":""},{"$f":"IF(eSPAR!A11=\"\",\"\",PERCENTAGE2!X12)","v":""},{"$f":"IF(eSPAR!A11=\"\",\"\",PERCENTAGE2!Y12)","v":""},{"$f":"IF(eSPAR!A11=\"\",\"\",PERCENTAGE2!Z12)","v":""},{"$f":"IF(eSPAR!A11=\"\",\"\",PERCENTAGE2!AA12)","v":""},{"$f":"IF(eSPAR!A11=\"\",\"\",PERCENTAGE2!AB12)","v":""}]
[{"$f":"eSPAR!A12","v":0},{"$f":"eSPAR!B12","v":0},{"$f":"IF(eSPAR!A12=\"\",\"\",PERCENTAGE2!W13)","v":""},{"$f":"IF(eSPAR!A12=\"\",\"\",PERCENTAGE2!X13)","v":""},{"$f":"IF(eSPAR!A12=\"\",\"\",PERCENTAGE2!Y13)","v":""},{"$f":"IF(eSPAR!A12=\"\",\"\",PERCENTAGE2!Z13)","v":""},{"$f":"IF(eSPAR!A12=\"\",\"\",PERCENTAGE2!AA13)","v":""},{"$f":"IF(eSPAR!A12=\"\",\"\",PERCENTAGE2!AB13)","v":""}]
[{"$f":"eSPAR!A13","v":0},{"$f":"eSPAR!B13","v":0},{"$f":"IF(eSPAR!A13=\"\",\"\",PERCENTAGE2!W14)","v":""},{"$f":"IF(eSPAR!A13=\"\",\"\",PERCENTAGE2!X14)","v":""},{"$f":"IF(eSPAR!A13=\"\",\"\",PERCENTAGE2!Y14)","v":""},{"$f":"IF(eSPAR!A13=\"\",\"\",PERCENTAGE2!Z14)","v":""},{"$f":"IF(eSPAR!A13=\"\",\"\",PERCENTAGE2!AA14)","v":""},{"$f":"IF(eSPAR!A13=\"\",\"\",PERCENTAGE2!AB14)","v":""}]
[{"$f":"eSPAR!A14","v":0},{"$f":"eSPAR!B14","v":0},{"$f":"IF(eSPAR!A14=\"\",\"\",PERCENTAGE2!W15)","v":""},{"$f":"IF(eSPAR!A14=\"\",\"\",PERCENTAGE2!X15)","v":""},{"$f":"IF(eSPAR!A14=\"\",\"\",PERCENTAGE2!Y15)","v":""},{"$f":"IF(eSPAR!A14=\"\",\"\",PERCENTAGE2!Z15)","v":""},{"$f":"IF(eSPAR!A14=\"\",\"\",PERCENTAGE2!AA15)","v":""},{"$f":"IF(eSPAR!A14=\"\",\"\",PERCENTAGE2!AB15)","v":""}]
[{"$f":"eSPAR!A15","v":0},{"$f":"eSPAR!B15","v":0},{"$f":"IF(eSPAR!A15=\"\",\"\",PERCENTAGE2!W16)","v":""},{"$f":"IF(eSPAR!A15=\"\",\"\",PERCENTAGE2!X16)","v":""},{"$f":"IF(eSPAR!A15=\"\",\"\",PERCENTAGE2!Y16)","v":""},{"$f":"IF(eSPAR!A15=\"\",\"\",PERCENTAGE2!Z16)","v":""},{"$f":"IF(eSPAR!A15=\"\",\"\",PERCENTAGE2!AA16)","v":""},{"$f":"IF(eSPAR!A15=\"\",\"\",PERCENTAGE2!AB16)","v":""}]
[{"$f":"eSPAR!A16","v":0},{"$f":"eSPAR!B16","v":0},{"$f":"IF(eSPAR!A16=\"\",\"\",PERCENTAGE2!W17)","v":""},{"$f":"IF(eSPAR!A16=\"\",\"\",PERCENTAGE2!X17)","v":""},{"$f":"IF(eSPAR!A16=\"\",\"\",PERCENTAGE2!Y17)","v":""},{"$f":"IF(eSPAR!A16=\"\",\"\",PERCENTAGE2!Z17)","v":""},{"$f":"IF(eSPAR!A16=\"\",\"\",PERCENTAGE2!AA17)","v":""},{"$f":"IF(eSPAR!A16=\"\",\"\",PERCENTAGE2!AB17)","v":""}]
[{"$f":"eSPAR!A17","v":0},{"$f":"eSPAR!B17","v":0},{"$f":"IF(eSPAR!A17=\"\",\"\",PERCENTAGE2!W18)","v":""},{"$f":"IF(eSPAR!A17=\"\",\"\",PERCENTAGE2!X18)","v":""},{"$f":"IF(eSPAR!A17=\"\",\"\",PERCENTAGE2!Y18)","v":""},{"$f":"IF(eSPAR!A17=\"\",\"\",PERCENTAGE2!Z18)","v":""},{"$f":"IF(eSPAR!A17=\"\",\"\",PERCENTAGE2!AA18)","v":""},{"$f":"IF(eSPAR!A17=\"\",\"\",PERCENTAGE2!AB18)","v":""}]
[{"$f":"eSPAR!A18","v":0},{"$f":"eSPAR!B18","v":0},{"$f":"IF(eSPAR!A18=\"\",\"\",PERCENTAGE2!W19)","v":""},{"$f":"IF(eSPAR!A18=\"\",\"\",PERCENTAGE2!X19)","v":""},{"$f":"IF(eSPAR!A18=\"\",\"\",PERCENTAGE2!Y19)","v":""},{"$f":"IF(eSPAR!A18=\"\",\"\",PERCENTAGE2!Z19)","v":""},{"$f":"IF(eSPAR!A18=\"\",\"\",PERCENTAGE2!AA19)","v":""},{"$f":"IF(eSPAR!A18=\"\",\"\",PERCENTAGE2!AB19)","v":""}]
[{"$f":"eSPAR!A19","v":0},{"$f":"eSPAR!B19","v":0},{"$f":"IF(eSPAR!A19=\"\",\"\",PERCENTAGE2!W20)","v":""},{"$f":"IF(eSPAR!A19=\"\",\"\",PERCENTAGE2!X20)","v":""},{"$f":"IF(eSPAR!A19=\"\",\"\",PERCENTAGE2!Y20)","v":""},{"$f":"IF(eSPAR!A19=\"\",\"\",PERCENTAGE2!Z20)","v":""},{"$f":"IF(eSPAR!A19=\"\",\"\",PERCENTAGE2!AA20)","v":""},{"$f":"IF(eSPAR!A19=\"\",\"\",PERCENTAGE2!AB20)","v":""}]
[{"$f":"eSPAR!A20","v":0},{"$f":"eSPAR!B20","v":0},{"$f":"IF(eSPAR!A20=\"\",\"\",PERCENTAGE2!W21)","v":""},{"$f":"IF(eSPAR!A20=\"\",\"\",PERCENTAGE2!X21)","v":""},{"$f":"IF(eSPAR!A20=\"\",\"\",PERCENTAGE2!Y21)","v":""},{"$f":"IF(eSPAR!A20=\"\",\"\",PERCENTAGE2!Z21)","v":""},{"$f":"IF(eSPAR!A20=\"\",\"\",PERCENTAGE2!AA21)","v":""},{"$f":"IF(eSPAR!A20=\"\",\"\",PERCENTAGE2!AB21)","v":""}]
[{"$f":"eSPAR!A21","v":0},{"$f":"eSPAR!B21","v":0},{"$f":"IF(eSPAR!A21=\"\",\"\",PERCENTAGE2!W22)","v":""},{"$f":"IF(eSPAR!A21=\"\",\"\",PERCENTAGE2!X22)","v":""},{"$f":"IF(eSPAR!A21=\"\",\"\",PERCENTAGE2!Y22)","v":""},{"$f":"IF(eSPAR!A21=\"\",\"\",PERCENTAGE2!Z22)","v":""},{"$f":"IF(eSPAR!A21=\"\",\"\",PERCENTAGE2!AA22)","v":""},{"$f":"IF(eSPAR!A21=\"\",\"\",PERCENTAGE2!AB22)","v":""}]
[{"$f":"eSPAR!A22","v":0},{"$f":"eSPAR!B22","v":0},{"$f":"IF(eSPAR!A22=\"\",\"\",PERCENTAGE2!W23)","v":""},{"$f":"IF(eSPAR!A22=\"\",\"\",PERCENTAGE2!X23)","v":""},{"$f":"IF(eSPAR!A22=\"\",\"\",PERCENTAGE2!Y23)","v":""},{"$f":"IF(eSPAR!A22=\"\",\"\",PERCENTAGE2!Z23)","v":""},{"$f":"IF(eSPAR!A22=\"\",\"\",PERCENTAGE2!AA23)","v":""},{"$f":"IF(eSPAR!A22=\"\",\"\",PERCENTAGE2!AB23)","v":""}]
[{"$f":"eSPAR!A23","v":0},{"$f":"eSPAR!B23","v":0},{"$f":"IF(eSPAR!A23=\"\",\"\",PERCENTAGE2!W24)","v":""},{"$f":"IF(eSPAR!A23=\"\",\"\",PERCENTAGE2!X24)","v":""},{"$f":"IF(eSPAR!A23=\"\",\"\",PERCENTAGE2!Y24)","v":""},{"$f":"IF(eSPAR!A23=\"\",\"\",PERCENTAGE2!Z24)","v":""},{"$f":"IF(eSPAR!A23=\"\",\"\",PERCENTAGE2!AA24)","v":""},{"$f":"IF(eSPAR!A23=\"\",\"\",PERCENTAGE2!AB24)","v":""}]
[{"$f":"eSPAR!A24","v":0},{"$f":"eSPAR!B24","v":0},{"$f":"IF(eSPAR!A24=\"\",\"\",PERCENTAGE2!W25)","v":""},{"$f":"IF(eSPAR!A24=\"\",\"\",PERCENTAGE2!X25)","v":""},{"$f":"IF(eSPAR!A24=\"\",\"\",PERCENTAGE2!Y25)","v":""},{"$f":"IF(eSPAR!A24=\"\",\"\",PERCENTAGE2!Z25)","v":""},{"$f":"IF(eSPAR!A24=\"\",\"\",PERCENTAGE2!AA25)","v":""},{"$f":"IF(eSPAR!A24=\"\",\"\",PERCENTAGE2!AB25)","v":""}]
[{"$f":"eSPAR!A25","v":0},{"$f":"eSPAR!B25","v":0},{"$f":"IF(eSPAR!A25=\"\",\"\",PERCENTAGE2!W26)","v":""},{"$f":"IF(eSPAR!A25=\"\",\"\",PERCENTAGE2!X26)","v":""},{"$f":"IF(eSPAR!A25=\"\",\"\",PERCENTAGE2!Y26)","v":""},{"$f":"IF(eSPAR!A25=\"\",\"\",PERCENTAGE2!Z26)","v":""},{"$f":"IF(eSPAR!A25=\"\",\"\",PERCENTAGE2!AA26)","v":""},{"$f":"IF(eSPAR!A25=\"\",\"\",PERCENTAGE2!AB26)","v":""}]
[{"$f":"eSPAR!A26","v":0},{"$f":"eSPAR!B26","v":0},{"$f":"IF(eSPAR!A26=\"\",\"\",PERCENTAGE2!W27)","v":""},{"$f":"IF(eSPAR!A26=\"\",\"\",PERCENTAGE2!X27)","v":""},{"$f":"IF(eSPAR!A26=\"\",\"\",PERCENTAGE2!Y27)","v":""},{"$f":"IF(eSPAR!A26=\"\",\"\",PERCENTAGE2!Z27)","v":""},{"$f":"IF(eSPAR!A26=\"\",\"\",PERCENTAGE2!AA27)","v":""},{"$f":"IF(eSPAR!A26=\"\",\"\",PERCENTAGE2!AB27)","v":""}]
[{"$f":"eSPAR!A27","v":0},{"$f":"eSPAR!B27","v":0},{"$f":"IF(eSPAR!A27=\"\",\"\",PERCENTAGE2!W28)","v":""},{"$f":"IF(eSPAR!A27=\"\",\"\",PERCENTAGE2!X28)","v":""},{"$f":"IF(eSPAR!A27=\"\",\"\",PERCENTAGE2!Y28)","v":""},{"$f":"IF(eSPAR!A27=\"\",\"\",PERCENTAGE2!Z28)","v":""},{"$f":"IF(eSPAR!A27=\"\",\"\",PERCENTAGE2!AA28)","v":""},{"$f":"IF(eSPAR!A27=\"\",\"\",PERCENTAGE2!AB28)","v":""}]
[{"$f":"eSPAR!A28","v":0},{"$f":"eSPAR!B28","v":0},{"$f":"IF(eSPAR!A28=\"\",\"\",PERCENTAGE2!W29)","v":""},{"$f":"IF(eSPAR!A28=\"\",\"\",PERCENTAGE2!X29)","v":""},{"$f":"IF(eSPAR!A28=\"\",\"\",PERCENTAGE2!Y29)","v":""},{"$f":"IF(eSPAR!A28=\"\",\"\",PERCENTAGE2!Z29)","v":""},{"$f":"IF(eSPAR!A28=\"\",\"\",PERCENTAGE2!AA29)","v":""},{"$f":"IF(eSPAR!A28=\"\",\"\",PERCENTAGE2!AB29)","v":""}]
[{"$f":"eSPAR!A29","v":0},{"$f":"eSPAR!B29","v":0},{"$f":"IF(eSPAR!A29=\"\",\"\",PERCENTAGE2!W30)","v":""},{"$f":"IF(eSPAR!A29=\"\",\"\",PERCENTAGE2!X30)","v":""},{"$f":"IF(eSPAR!A29=\"\",\"\",PERCENTAGE2!Y30)","v":""},{"$f":"IF(eSPAR!A29=\"\",\"\",PERCENTAGE2!Z30)","v":""},{"$f":"IF(eSPAR!A29=\"\",\"\",PERCENTAGE2!AA30)","v":""},{"$f":"IF(eSPAR!A29=\"\",\"\",PERCENTAGE2!AB30)","v":""}]
[{"$f":"eSPAR!A30","v":0},{"$f":"eSPAR!B30","v":0},{"$f":"IF(eSPAR!A30=\"\",\"\",PERCENTAGE2!W31)","v":""},{"$f":"IF(eSPAR!A30=\"\",\"\",PERCENTAGE2!X31)","v":""},{"$f":"IF(eSPAR!A30=\"\",\"\",PERCENTAGE2!Y31)","v":""},{"$f":"IF(eSPAR!A30=\"\",\"\",PERCENTAGE2!Z31)","v":""},{"$f":"IF(eSPAR!A30=\"\",\"\",PERCENTAGE2!AA31)","v":""},{"$f":"IF(eSPAR!A30=\"\",\"\",PERCENTAGE2!AB31)","v":""}]
[{"$f":"eSPAR!A31","v":0},{"$f":"eSPAR!B31","v":0},{"$f":"IF(eSPAR!A31=\"\",\"\",PERCENTAGE2!W32)","v":""},{"$f":"IF(eSPAR!A31=\"\",\"\",PERCENTAGE2!X32)","v":""},{"$f":"IF(eSPAR!A31=\"\",\"\",PERCENTAGE2!Y32)","v":""},{"$f":"IF(eSPAR!A31=\"\",\"\",PERCENTAGE2!Z32)","v":""},{"$f":"IF(eSPAR!A31=\"\",\"\",PERCENTAGE2!AA32)","v":""},{"$f":"IF(eSPAR!A31=\"\",\"\",PERCENTAGE2!AB32)","v":""}]
[{"$f":"eSPAR!A32","v":0},{"$f":"eSPAR!B32","v":0},{"$f":"IF(eSPAR!A32=\"\",\"\",PERCENTAGE2!W33)","v":""},{"$f":"IF(eSPAR!A32=\"\",\"\",PERCENTAGE2!X33)","v":""},{"$f":"IF(eSPAR!A32=\"\",\"\",PERCENTAGE2!Y33)","v":""},{"$f":"IF(eSPAR!A32=\"\",\"\",PERCENTAGE2!Z33)","v":""},{"$f":"IF(eSPAR!A32=\"\",\"\",PERCENTAGE2!AA33)","v":""},{"$f":"IF(eSPAR!A32=\"\",\"\",PERCENTAGE2!AB33)","v":""}]
[{"$f":"eSPAR!A33","v":0},{"$f":"eSPAR!B33","v":0},{"$f":"IF(eSPAR!A33=\"\",\"\",PERCENTAGE2!W34)","v":""},{"$f":"IF(eSPAR!A33=\"\",\"\",PERCENTAGE2!X34)","v":""},{"$f":"IF(eSPAR!A33=\"\",\"\",PERCENTAGE2!Y34)","v":""},{"$f":"IF(eSPAR!A33=\"\",\"\",PERCENTAGE2!Z34)","v":""},{"$f":"IF(eSPAR!A33=\"\",\"\",PERCENTAGE2!AA34)","v":""},{"$f":"IF(eSPAR!A33=\"\",\"\",PERCENTAGE2!AB34)","v":""}]
[{"$f":"eSPAR!A34","v":0},{"$f":"eSPAR!B34","v":0},{"$f":"IF(eSPAR!A34=\"\",\"\",PERCENTAGE2!W35)","v":""},{"$f":"IF(eSPAR!A34=\"\",\"\",PERCENTAGE2!X35)","v":""},{"$f":"IF(eSPAR!A34=\"\",\"\",PERCENTAGE2!Y35)","v":""},{"$f":"IF(eSPAR!A34=\"\",\"\",PERCENTAGE2!Z35)","v":""},{"$f":"IF(eSPAR!A34=\"\",\"\",PERCENTAGE2!AA35)","v":""},{"$f":"IF(eSPAR!A34=\"\",\"\",PERCENTAGE2!AB35)","v":""}]
[{"$f":"eSPAR!A35","v":0},{"$f":"eSPAR!B35","v":0},{"$f":"IF(eSPAR!A35=\"\",\"\",PERCENTAGE2!W36)","v":""},{"$f":"IF(eSPAR!A35=\"\",\"\",PERCENTAGE2!X36)","v":""},{"$f":"IF(eSPAR!A35=\"\",\"\",PERCENTAGE2!Y36)","v":""},{"$f":"IF(eSPAR!A35=\"\",\"\",PERCENTAGE2!Z36)","v":""},{"$f":"IF(eSPAR!A35=\"\",\"\",PERCENTAGE2!AA36)","v":""},{"$f":"IF(eSPAR!A35=\"\",\"\",PERCENTAGE2!AB36)","v":""}]
[{"$f":"eSPAR!A36","v":0},{"$f":"eSPAR!B36","v":0},{"$f":"IF(eSPAR!A36=\"\",\"\",PERCENTAGE2!W37)","v":""},{"$f":"IF(eSPAR!A36=\"\",\"\",PERCENTAGE2!X37)","v":""},{"$f":"IF(eSPAR!A36=\"\",\"\",PERCENTAGE2!Y37)","v":""},{"$f":"IF(eSPAR!A36=\"\",\"\",PERCENTAGE2!Z37)","v":""},{"$f":"IF(eSPAR!A36=\"\",\"\",PERCENTAGE2!AA37)","v":""},{"$f":"IF(eSPAR!A36=\"\",\"\",PERCENTAGE2!AB37)","v":""}]
[{"$f":"eSPAR!A37","v":0},{"$f":"eSPAR!B37","v":0},{"$f":"IF(eSPAR!A37=\"\",\"\",PERCENTAGE2!W38)","v":""},{"$f":"IF(eSPAR!A37=\"\",\"\",PERCENTAGE2!X38)","v":""},{"$f":"IF(eSPAR!A37=\"\",\"\",PERCENTAGE2!Y38)","v":""},{"$f":"IF(eSPAR!A37=\"\",\"\",PERCENTAGE2!Z38)","v":""},{"$f":"IF(eSPAR!A37=\"\",\"\",PERCENTAGE2!AA38)","v":""},{"$f":"IF(eSPAR!A37=\"\",\"\",PERCENTAGE2!AB38)","v":""}]
[{"$f":"eSPAR!A38","v":0},{"$f":"eSPAR!B38","v":0},{"$f":"IF(eSPAR!A38=\"\",\"\",PERCENTAGE2!W39)","v":""},{"$f":"IF(eSPAR!A38=\"\",\"\",PERCENTAGE2!X39)","v":""},{"$f":"IF(eSPAR!A38=\"\",\"\",PERCENTAGE2!Y39)","v":""},{"$f":"IF(eSPAR!A38=\"\",\"\",PERCENTAGE2!Z39)","v":""},{"$f":"IF(eSPAR!A38=\"\",\"\",PERCENTAGE2!AA39)","v":""},{"$f":"IF(eSPAR!A38=\"\",\"\",PERCENTAGE2!AB39)","v":""}]
[{"$f":"eSPAR!A39","v":0},{"$f":"eSPAR!B39","v":0},{"$f":"IF(eSPAR!A39=\"\",\"\",PERCENTAGE2!W40)","v":""},{"$f":"IF(eSPAR!A39=\"\",\"\",PERCENTAGE2!X40)","v":""},{"$f":"IF(eSPAR!A39=\"\",\"\",PERCENTAGE2!Y40)","v":""},{"$f":"IF(eSPAR!A39=\"\",\"\",PERCENTAGE2!Z40)","v":""},{"$f":"IF(eSPAR!A39=\"\",\"\",PERCENTAGE2!AA40)","v":""},{"$f":"IF(eSPAR!A39=\"\",\"\",PERCENTAGE2!AB40)","v":""}]
[{"$f":"eSPAR!A40","v":0},{"$f":"eSPAR!B40","v":0},{"$f":"IF(eSPAR!A40=\"\",\"\",PERCENTAGE2!W41)","v":""},{"$f":"IF(eSPAR!A40=\"\",\"\",PERCENTAGE2!X41)","v":""},{"$f":"IF(eSPAR!A40=\"\",\"\",PERCENTAGE2!Y41)","v":""},{"$f":"IF(eSPAR!A40=\"\",\"\",PERCENTAGE2!Z41)","v":""},{"$f":"IF(eSPAR!A40=\"\",\"\",PERCENTAGE2!AA41)","v":""},{"$f":"IF(eSPAR!A40=\"\",\"\",PERCENTAGE2!AB41)","v":""}]
[{"$f":"eSPAR!A41","v":0},{"$f":"eSPAR!B41","v":0},{"$f":"IF(eSPAR!A41=\"\",\"\",PERCENTAGE2!W42)","v":""},{"$f":"IF(eSPAR!A41=\"\",\"\",PERCENTAGE2!X42)","v":""},{"$f":"IF(eSPAR!A41=\"\",\"\",PERCENTAGE2!Y42)","v":""},{"$f":"IF(eSPAR!A41=\"\",\"\",PERCENTAGE2!Z42)","v":""},{"$f":"IF(eSPAR!A41=\"\",\"\",PERCENTAGE2!AA42)","v":""},{"$f":"IF(eSPAR!A41=\"\",\"\",PERCENTAGE2!AB42)","v":""}]
[{"$f":"eSPAR!A42","v":0},{"$f":"eSPAR!B42","v":0},{"$f":"IF(eSPAR!A42=\"\",\"\",PERCENTAGE2!W43)","v":""},{"$f":"IF(eSPAR!A42=\"\",\"\",PERCENTAGE2!X43)","v":""},{"$f":"IF(eSPAR!A42=\"\",\"\",PERCENTAGE2!Y43)","v":""},{"$f":"IF(eSPAR!A42=\"\",\"\",PERCENTAGE2!Z43)","v":""},{"$f":"IF(eSPAR!A42=\"\",\"\",PERCENTAGE2!AA43)","v":""},{"$f":"IF(eSPAR!A42=\"\",\"\",PERCENTAGE2!AB43)","v":""}]
[{"$f":"eSPAR!A43","v":0},{"$f":"eSPAR!B43","v":0},{"$f":"IF(eSPAR!A43=\"\",\"\",PERCENTAGE2!W44)","v":""},{"$f":"IF(eSPAR!A43=\"\",\"\",PERCENTAGE2!X44)","v":""},{"$f":"IF(eSPAR!A43=\"\",\"\",PERCENTAGE2!Y44)","v":""},{"$f":"IF(eSPAR!A43=\"\",\"\",PERCENTAGE2!Z44)","v":""},{"$f":"IF(eSPAR!A43=\"\",\"\",PERCENTAGE2!AA44)","v":""},{"$f":"IF(eSPAR!A43=\"\",\"\",PERCENTAGE2!AB44)","v":""}]
[{"$f":"eSPAR!A44","v":0},{"$f":"eSPAR!B44","v":0},{"$f":"IF(eSPAR!A44=\"\",\"\",PERCENTAGE2!W45)","v":""},{"$f":"IF(eSPAR!A44=\"\",\"\",PERCENTAGE2!X45)","v":""},{"$f":"IF(eSPAR!A44=\"\",\"\",PERCENTAGE2!Y45)","v":""},{"$f":"IF(eSPAR!A44=\"\",\"\",PERCENTAGE2!Z45)","v":""},{"$f":"IF(eSPAR!A44=\"\",\"\",PERCENTAGE2!AA45)","v":""},{"$f":"IF(eSPAR!A44=\"\",\"\",PERCENTAGE2!AB45)","v":""}]
[{"$f":"eSPAR!A45","v":0},{"$f":"eSPAR!B45","v":0},{"$f":"IF(eSPAR!A45=\"\",\"\",PERCENTAGE2!W46)","v":""},{"$f":"IF(eSPAR!A45=\"\",\"\",PERCENTAGE2!X46)","v":""},{"$f":"IF(eSPAR!A45=\"\",\"\",PERCENTAGE2!Y46)","v":""},{"$f":"IF(eSPAR!A45=\"\",\"\",PERCENTAGE2!Z46)","v":""},{"$f":"IF(eSPAR!A45=\"\",\"\",PERCENTAGE2!AA46)","v":""},{"$f":"IF(eSPAR!A45=\"\",\"\",PERCENTAGE2!AB46)","v":""}]
[{"$f":"eSPAR!A46","v":0},{"$f":"eSPAR!B46","v":0},{"$f":"IF(eSPAR!A46=\"\",\"\",PERCENTAGE2!W47)","v":""},{"$f":"IF(eSPAR!A46=\"\",\"\",PERCENTAGE2!X47)","v":""},{"$f":"IF(eSPAR!A46=\"\",\"\",PERCENTAGE2!Y47)","v":""},{"$f":"IF(eSPAR!A46=\"\",\"\",PERCENTAGE2!Z47)","v":""},{"$f":"IF(eSPAR!A46=\"\",\"\",PERCENTAGE2!AA47)","v":""},{"$f":"IF(eSPAR!A46=\"\",\"\",PERCENTAGE2!AB47)","v":""}]
[{"$f":"eSPAR!A47","v":0},{"$f":"eSPAR!B47","v":0},{"$f":"IF(eSPAR!A47=\"\",\"\",PERCENTAGE2!W48)","v":""},{"$f":"IF(eSPAR!A47=\"\",\"\",PERCENTAGE2!X48)","v":""},{"$f":"IF(eSPAR!A47=\"\",\"\",PERCENTAGE2!Y48)","v":""},{"$f":"IF(eSPAR!A47=\"\",\"\",PERCENTAGE2!Z48)","v":""},{"$f":"IF(eSPAR!A47=\"\",\"\",PERCENTAGE2!AA48)","v":""},{"$f":"IF(eSPAR!A47=\"\",\"\",PERCENTAGE2!AB48)","v":""}]
[{"$f":"eSPAR!A48","v":0},{"$f":"eSPAR!B48","v":0},{"$f":"IF(eSPAR!A48=\"\",\"\",PERCENTAGE2!W49)","v":""},{"$f":"IF(eSPAR!A48=\"\",\"\",PERCENTAGE2!X49)","v":""},{"$f":"IF(eSPAR!A48=\"\",\"\",PERCENTAGE2!Y49)","v":""},{"$f":"IF(eSPAR!A48=\"\",\"\",PERCENTAGE2!Z49)","v":""},{"$f":"IF(eSPAR!A48=\"\",\"\",PERCENTAGE2!AA49)","v":""},{"$f":"IF(eSPAR!A48=\"\",\"\",PERCENTAGE2!AB49)","v":""}]
[{"$f":"eSPAR!A49","v":0},{"$f":"eSPAR!B49","v":0},{"$f":"IF(eSPAR!A49=\"\",\"\",PERCENTAGE2!W50)","v":""},{"$f":"IF(eSPAR!A49=\"\",\"\",PERCENTAGE2!X50)","v":""},{"$f":"IF(eSPAR!A49=\"\",\"\",PERCENTAGE2!Y50)","v":""},{"$f":"IF(eSPAR!A49=\"\",\"\",PERCENTAGE2!Z50)","v":""},{"$f":"IF(eSPAR!A49=\"\",\"\",PERCENTAGE2!AA50)","v":""},{"$f":"IF(eSPAR!A49=\"\",\"\",PERCENTAGE2!AB50)","v":""}]
[{"$f":"eSPAR!A50","v":0},{"$f":"eSPAR!B50","v":0},{"$f":"IF(eSPAR!A50=\"\",\"\",PERCENTAGE2!W51)","v":""},{"$f":"IF(eSPAR!A50=\"\",\"\",PERCENTAGE2!X51)","v":""},{"$f":"IF(eSPAR!A50=\"\",\"\",PERCENTAGE2!Y51)","v":""},{"$f":"IF(eSPAR!A50=\"\",\"\",PERCENTAGE2!Z51)","v":""},{"$f":"IF(eSPAR!A50=\"\",\"\",PERCENTAGE2!AA51)","v":""},{"$f":"IF(eSPAR!A50=\"\",\"\",PERCENTAGE2!AB51)","v":""}]
[{"$f":"eSPAR!A51","v":0},{"$f":"eSPAR!B51","v":0},{"$f":"IF(eSPAR!A51=\"\",\"\",PERCENTAGE2!W52)","v":""},{"$f":"IF(eSPAR!A51=\"\",\"\",PERCENTAGE2!X52)","v":""},{"$f":"IF(eSPAR!A51=\"\",\"\",PERCENTAGE2!Y52)","v":""},{"$f":"IF(eSPAR!A51=\"\",\"\",PERCENTAGE2!Z52)","v":""},{"$f":"IF(eSPAR!A51=\"\",\"\",PERCENTAGE2!AA52)","v":""},{"$f":"IF(eSPAR!A51=\"\",\"\",PERCENTAGE2!AB52)","v":""}]
[{"$f":"eSPAR!A52","v":0},{"$f":"eSPAR!B52","v":0},{"$f":"IF(eSPAR!A52=\"\",\"\",PERCENTAGE2!W53)","v":""},{"$f":"IF(eSPAR!A52=\"\",\"\",PERCENTAGE2!X53)","v":""},{"$f":"IF(eSPAR!A52=\"\",\"\",PERCENTAGE2!Y53)","v":""},{"$f":"IF(eSPAR!A52=\"\",\"\",PERCENTAGE2!Z53)","v":""},{"$f":"IF(eSPAR!A52=\"\",\"\",PERCENTAGE2!AA53)","v":""},{"$f":"IF(eSPAR!A52=\"\",\"\",PERCENTAGE2!AB53)","v":""}]
[{"$f":"eSPAR!A53","v":0},{"$f":"eSPAR!B53","v":0},{"$f":"IF(eSPAR!A53=\"\",\"\",PERCENTAGE2!W54)","v":""},{"$f":"IF(eSPAR!A53=\"\",\"\",PERCENTAGE2!X54)","v":""},{"$f":"IF(eSPAR!A53=\"\",\"\",PERCENTAGE2!Y54)","v":""},{"$f":"IF(eSPAR!A53=\"\",\"\",PERCENTAGE2!Z54)","v":""},{"$f":"IF(eSPAR!A53=\"\",\"\",PERCENTAGE2!AA54)","v":""},{"$f":"IF(eSPAR!A53=\"\",\"\",PERCENTAGE2!AB54)","v":""}]
[{"$f":"eSPAR!A54","v":0},{"$f":"eSPAR!B54","v":0},{"$f":"IF(eSPAR!A54=\"\",\"\",PERCENTAGE2!W55)","v":""},{"$f":"IF(eSPAR!A54=\"\",\"\",PERCENTAGE2!X55)","v":""},{"$f":"IF(eSPAR!A54=\"\",\"\",PERCENTAGE2!Y55)","v":""},{"$f":"IF(eSPAR!A54=\"\",\"\",PERCENTAGE2!Z55)","v":""},{"$f":"IF(eSPAR!A54=\"\",\"\",PERCENTAGE2!AA55)","v":""},{"$f":"IF(eSPAR!A54=\"\",\"\",PERCENTAGE2!AB55)","v":""}]
[{"$f":"eSPAR!A55","v":0},{"$f":"eSPAR!B55","v":0},{"$f":"IF(eSPAR!A55=\"\",\"\",PERCENTAGE2!W56)","v":""},{"$f":"IF(eSPAR!A55=\"\",\"\",PERCENTAGE2!X56)","v":""},{"$f":"IF(eSPAR!A55=\"\",\"\",PERCENTAGE2!Y56)","v":""},{"$f":"IF(eSPAR!A55=\"\",\"\",PERCENTAGE2!Z56)","v":""},{"$f":"IF(eSPAR!A55=\"\",\"\",PERCENTAGE2!AA56)","v":""},{"$f":"IF(eSPAR!A55=\"\",\"\",PERCENTAGE2!AB56)","v":""}]
[{"$f":"eSPAR!A56","v":0},{"$f":"eSPAR!B56","v":0},{"$f":"IF(eSPAR!A56=\"\",\"\",PERCENTAGE2!W57)","v":""},{"$f":"IF(eSPAR!A56=\"\",\"\",PERCENTAGE2!X57)","v":""},{"$f":"IF(eSPAR!A56=\"\",\"\",PERCENTAGE2!Y57)","v":""},{"$f":"IF(eSPAR!A56=\"\",\"\",PERCENTAGE2!Z57)","v":""},{"$f":"IF(eSPAR!A56=\"\",\"\",PERCENTAGE2!AA57)","v":""},{"$f":"IF(eSPAR!A56=\"\",\"\",PERCENTAGE2!AB57)","v":""}]
[{"$f":"eSPAR!A57","v":0},{"$f":"eSPAR!B57","v":0},{"$f":"IF(eSPAR!A57=\"\",\"\",PERCENTAGE2!W58)","v":""},{"$f":"IF(eSPAR!A57=\"\",\"\",PERCENTAGE2!X58)","v":""},{"$f":"IF(eSPAR!A57=\"\",\"\",PERCENTAGE2!Y58)","v":""},{"$f":"IF(eSPAR!A57=\"\",\"\",PERCENTAGE2!Z58)","v":""},{"$f":"IF(eSPAR!A57=\"\",\"\",PERCENTAGE2!AA58)","v":""},{"$f":"IF(eSPAR!A57=\"\",\"\",PERCENTAGE2!AB58)","v":""}]
[{"$f":"eSPAR!A58","v":0},{"$f":"eSPAR!B58","v":0},{"$f":"IF(eSPAR!A58=\"\",\"\",PERCENTAGE2!W59)","v":""},{"$f":"IF(eSPAR!A58=\"\",\"\",PERCENTAGE2!X59)","v":""},{"$f":"IF(eSPAR!A58=\"\",\"\",PERCENTAGE2!Y59)","v":""},{"$f":"IF(eSPAR!A58=\"\",\"\",PERCENTAGE2!Z59)","v":""},{"$f":"IF(eSPAR!A58=\"\",\"\",PERCENTAGE2!AA59)","v":""},{"$f":"IF(eSPAR!A58=\"\",\"\",PERCENTAGE2!AB59)","v":""}]
[{"$f":"eSPAR!A59","v":0},{"$f":"eSPAR!B59","v":0},{"$f":"IF(eSPAR!A59=\"\",\"\",PERCENTAGE2!W60)","v":""},{"$f":"IF(eSPAR!A59=\"\",\"\",PERCENTAGE2!X60)","v":""},{"$f":"IF(eSPAR!A59=\"\",\"\",PERCENTAGE2!Y60)","v":""},{"$f":"IF(eSPAR!A59=\"\",\"\",PERCENTAGE2!Z60)","v":""},{"$f":"IF(eSPAR!A59=\"\",\"\",PERCENTAGE2!AA60)","v":""},{"$f":"IF(eSPAR!A59=\"\",\"\",PERCENTAGE2!AB60)","v":""}]
[{"$f":"eSPAR!A60","v":0},{"$f":"eSPAR!B60","v":0},{"$f":"IF(eSPAR!A60=\"\",\"\",PERCENTAGE2!W61)","v":""},{"$f":"IF(eSPAR!A60=\"\",\"\",PERCENTAGE2!X61)","v":""},{"$f":"IF(eSPAR!A60=\"\",\"\",PERCENTAGE2!Y61)","v":""},{"$f":"IF(eSPAR!A60=\"\",\"\",PERCENTAGE2!Z61)","v":""},{"$f":"IF(eSPAR!A60=\"\",\"\",PERCENTAGE2!AA61)","v":""},{"$f":"IF(eSPAR!A60=\"\",\"\",PERCENTAGE2!AB61)","v":""}]
[{"$f":"eSPAR!A61","v":0},{"$f":"eSPAR!B61","v":0},{"$f":"IF(eSPAR!A61=\"\",\"\",PERCENTAGE2!W62)","v":""},{"$f":"IF(eSPAR!A61=\"\",\"\",PERCENTAGE2!X62)","v":""},{"$f":"IF(eSPAR!A61=\"\",\"\",PERCENTAGE2!Y62)","v":""},{"$f":"IF(eSPAR!A61=\"\",\"\",PERCENTAGE2!Z62)","v":""},{"$f":"IF(eSPAR!A61=\"\",\"\",PERCENTAGE2!AA62)","v":""},{"$f":"IF(eSPAR!A61=\"\",\"\",PERCENTAGE2!AB62)","v":""}]
[{"$f":"eSPAR!A62","v":0},{"$f":"eSPAR!B62","v":0},{"$f":"IF(eSPAR!A62=\"\",\"\",PERCENTAGE2!W63)","v":""},{"$f":"IF(eSPAR!A62=\"\",\"\",PERCENTAGE2!X63)","v":""},{"$f":"IF(eSPAR!A62=\"\",\"\",PERCENTAGE2!Y63)","v":""},{"$f":"IF(eSPAR!A62=\"\",\"\",PERCENTAGE2!Z63)","v":""},{"$f":"IF(eSPAR!A62=\"\",\"\",PERCENTAGE2!AA63)","v":""},{"$f":"IF(eSPAR!A62=\"\",\"\",PERCENTAGE2!AB63)","v":""}]
[{"$f":"eSPAR!A63","v":0},{"$f":"eSPAR!B63","v":0},{"$f":"IF(eSPAR!A63=\"\",\"\",PERCENTAGE2!W64)","v":""},{"$f":"IF(eSPAR!A63=\"\",\"\",PERCENTAGE2!X64)","v":""},{"$f":"IF(eSPAR!A63=\"\",\"\",PERCENTAGE2!Y64)","v":""},{"$f":"IF(eSPAR!A63=\"\",\"\",PERCENTAGE2!Z64)","v":""},{"$f":"IF(eSPAR!A63=\"\",\"\",PERCENTAGE2!AA64)","v":""},{"$f":"IF(eSPAR!A63=\"\",\"\",PERCENTAGE2!AB64)","v":""}]
[{"$f":"eSPAR!A64","v":0},{"$f":"eSPAR!B64","v":0},{"$f":"IF(eSPAR!A64=\"\",\"\",PERCENTAGE2!W65)","v":""},{"$f":"IF(eSPAR!A64=\"\",\"\",PERCENTAGE2!X65)","v":""},{"$f":"IF(eSPAR!A64=\"\",\"\",PERCENTAGE2!Y65)","v":""},{"$f":"IF(eSPAR!A64=\"\",\"\",PERCENTAGE2!Z65)","v":""},{"$f":"IF(eSPAR!A64=\"\",\"\",PERCENTAGE2!AA65)","v":""},{"$f":"IF(eSPAR!A64=\"\",\"\",PERCENTAGE2!AB65)","v":""}]
[{"$f":"eSPAR!A65","v":0},{"$f":"eSPAR!B65","v":0},{"$f":"IF(eSPAR!A65=\"\",\"\",PERCENTAGE2!W66)","v":""},{"$f":"IF(eSPAR!A65=\"\",\"\",PERCENTAGE2!X66)","v":""},{"$f":"IF(eSPAR!A65=\"\",\"\",PERCENTAGE2!Y66)","v":""},{"$f":"IF(eSPAR!A65=\"\",\"\",PERCENTAGE2!Z66)","v":""},{"$f":"IF(eSPAR!A65=\"\",\"\",PERCENTAGE2!AA66)","v":""},{"$f":"IF(eSPAR!A65=\"\",\"\",PERCENTAGE2!AB66)","v":""}]
[{"$f":"eSPAR!A66","v":0},{"$f":"eSPAR!B66","v":0},{"$f":"IF(eSPAR!A66=\"\",\"\",PERCENTAGE2!W67)","v":""},{"$f":"IF(eSPAR!A66=\"\",\"\",PERCENTAGE2!X67)","v":""},{"$f":"IF(eSPAR!A66=\"\",\"\",PERCENTAGE2!Y67)","v":""},{"$f":"IF(eSPAR!A66=\"\",\"\",PERCENTAGE2!Z67)","v":""},{"$f":"IF(eSPAR!A66=\"\",\"\",PERCENTAGE2!AA67)","v":""},{"$f":"IF(eSPAR!A66=\"\",\"\",PERCENTAGE2!AB67)","v":""}]
[{"$f":"eSPAR!A67","v":0},{"$f":"eSPAR!B67","v":0},{"$f":"IF(eSPAR!A67=\"\",\"\",PERCENTAGE2!W68)","v":""},{"$f":"IF(eSPAR!A67=\"\",\"\",PERCENTAGE2!X68)","v":""},{"$f":"IF(eSPAR!A67=\"\",\"\",PERCENTAGE2!Y68)","v":""},{"$f":"IF(eSPAR!A67=\"\",\"\",PERCENTAGE2!Z68)","v":""},{"$f":"IF(eSPAR!A67=\"\",\"\",PERCENTAGE2!AA68)","v":""},{"$f":"IF(eSPAR!A67=\"\",\"\",PERCENTAGE2!AB68)","v":""}]
[{"$f":"eSPAR!A68","v":0},{"$f":"eSPAR!B68","v":0},{"$f":"IF(eSPAR!A68=\"\",\"\",PERCENTAGE2!W69)","v":""},{"$f":"IF(eSPAR!A68=\"\",\"\",PERCENTAGE2!X69)","v":""},{"$f":"IF(eSPAR!A68=\"\",\"\",PERCENTAGE2!Y69)","v":""},{"$f":"IF(eSPAR!A68=\"\",\"\",PERCENTAGE2!Z69)","v":""},{"$f":"IF(eSPAR!A68=\"\",\"\",PERCENTAGE2!AA69)","v":""},{"$f":"IF(eSPAR!A68=\"\",\"\",PERCENTAGE2!AB69)","v":""}]
[{"$f":"eSPAR!A69","v":0},{"$f":"eSPAR!B69","v":0},{"$f":"IF(eSPAR!A69=\"\",\"\",PERCENTAGE2!W70)","v":""},{"$f":"IF(eSPAR!A69=\"\",\"\",PERCENTAGE2!X70)","v":""},{"$f":"IF(eSPAR!A69=\"\",\"\",PERCENTAGE2!Y70)","v":""},{"$f":"IF(eSPAR!A69=\"\",\"\",PERCENTAGE2!Z70)","v":""},{"$f":"IF(eSPAR!A69=\"\",\"\",PERCENTAGE2!AA70)","v":""},{"$f":"IF(eSPAR!A69=\"\",\"\",PERCENTAGE2!AB70)","v":""}]
[{"$f":"eSPAR!A70","v":0},{"$f":"eSPAR!B70","v":0},{"$f":"IF(eSPAR!A70=\"\",\"\",PERCENTAGE2!W71)","v":""},{"$f":"IF(eSPAR!A70=\"\",\"\",PERCENTAGE2!X71)","v":""},{"$f":"IF(eSPAR!A70=\"\",\"\",PERCENTAGE2!Y71)","v":""},{"$f":"IF(eSPAR!A70=\"\",\"\",PERCENTAGE2!Z71)","v":""},{"$f":"IF(eSPAR!A70=\"\",\"\",PERCENTAGE2!AA71)","v":""},{"$f":"IF(eSPAR!A70=\"\",\"\",PERCENTAGE2!AB71)","v":""}]
[{"$f":"eSPAR!A71","v":0},{"$f":"eSPAR!B71","v":0},{"$f":"IF(eSPAR!A71=\"\",\"\",PERCENTAGE2!W72)","v":""},{"$f":"IF(eSPAR!A71=\"\",\"\",PERCENTAGE2!X72)","v":""},{"$f":"IF(eSPAR!A71=\"\",\"\",PERCENTAGE2!Y72)","v":""},{"$f":"IF(eSPAR!A71=\"\",\"\",PERCENTAGE2!Z72)","v":""},{"$f":"IF(eSPAR!A71=\"\",\"\",PERCENTAGE2!AA72)","v":""},{"$f":"IF(eSPAR!A71=\"\",\"\",PERCENTAGE2!AB72)","v":""}]
[{"$f":"eSPAR!A72","v":0},{"$f":"eSPAR!B72","v":0},{"$f":"IF(eSPAR!A72=\"\",\"\",PERCENTAGE2!W73)","v":""},{"$f":"IF(eSPAR!A72=\"\",\"\",PERCENTAGE2!X73)","v":""},{"$f":"IF(eSPAR!A72=\"\",\"\",PERCENTAGE2!Y73)","v":""},{"$f":"IF(eSPAR!A72=\"\",\"\",PERCENTAGE2!Z73)","v":""},{"$f":"IF(eSPAR!A72=\"\",\"\",PERCENTAGE2!AA73)","v":""},{"$f":"IF(eSPAR!A72=\"\",\"\",PERCENTAGE2!AB73)","v":""}]
[{"$f":"eSPAR!A73","v":0},{"$f":"eSPAR!B73","v":0},{"$f":"IF(eSPAR!A73=\"\",\"\",PERCENTAGE2!W74)","v":""},{"$f":"IF(eSPAR!A73=\"\",\"\",PERCENTAGE2!X74)","v":""},{"$f":"IF(eSPAR!A73=\"\",\"\",PERCENTAGE2!Y74)","v":""},{"$f":"IF(eSPAR!A73=\"\",\"\",PERCENTAGE2!Z74)","v":""},{"$f":"IF(eSPAR!A73=\"\",\"\",PERCENTAGE2!AA74)","v":""},{"$f":"IF(eSPAR!A73=\"\",\"\",PERCENTAGE2!AB74)","v":""}]
[{"$f":"eSPAR!A74","v":0},{"$f":"eSPAR!B74","v":0},{"$f":"IF(eSPAR!A74=\"\",\"\",PERCENTAGE2!W75)","v":""},{"$f":"IF(eSPAR!A74=\"\",\"\",PERCENTAGE2!X75)","v":""},{"$f":"IF(eSPAR!A74=\"\",\"\",PERCENTAGE2!Y75)","v":""},{"$f":"IF(eSPAR!A74=\"\",\"\",PERCENTAGE2!Z75)","v":""},{"$f":"IF(eSPAR!A74=\"\",\"\",PERCENTAGE2!AA75)","v":""},{"$f":"IF(eSPAR!A74=\"\",\"\",PERCENTAGE2!AB75)","v":""}]
[{"$f":"eSPAR!A75","v":0},{"$f":"eSPAR!B75","v":0},{"$f":"IF(eSPAR!A75=\"\",\"\",PERCENTAGE2!W76)","v":""},{"$f":"IF(eSPAR!A75=\"\",\"\",PERCENTAGE2!X76)","v":""},{"$f":"IF(eSPAR!A75=\"\",\"\",PERCENTAGE2!Y76)","v":""},{"$f":"IF(eSPAR!A75=\"\",\"\",PERCENTAGE2!Z76)","v":""},{"$f":"IF(eSPAR!A75=\"\",\"\",PERCENTAGE2!AA76)","v":""},{"$f":"IF(eSPAR!A75=\"\",\"\",PERCENTAGE2!AB76)","v":""}]
[{"$f":"eSPAR!A76","v":0},{"$f":"eSPAR!B76","v":0},{"$f":"IF(eSPAR!A76=\"\",\"\",PERCENTAGE2!W77)","v":""},{"$f":"IF(eSPAR!A76=\"\",\"\",PERCENTAGE2!X77)","v":""},{"$f":"IF(eSPAR!A76=\"\",\"\",PERCENTAGE2!Y77)","v":""},{"$f":"IF(eSPAR!A76=\"\",\"\",PERCENTAGE2!Z77)","v":""},{"$f":"IF(eSPAR!A76=\"\",\"\",PERCENTAGE2!AA77)","v":""},{"$f":"IF(eSPAR!A76=\"\",\"\",PERCENTAGE2!AB77)","v":""}]
[{"$f":"eSPAR!A77","v":0},{"$f":"eSPAR!B77","v":0},{"$f":"IF(eSPAR!A77=\"\",\"\",PERCENTAGE2!W78)","v":""},{"$f":"IF(eSPAR!A77=\"\",\"\",PERCENTAGE2!X78)","v":""},{"$f":"IF(eSPAR!A77=\"\",\"\",PERCENTAGE2!Y78)","v":""},{"$f":"IF(eSPAR!A77=\"\",\"\",PERCENTAGE2!Z78)","v":""},{"$f":"IF(eSPAR!A77=\"\",\"\",PERCENTAGE2!AA78)","v":""},{"$f":"IF(eSPAR!A77=\"\",\"\",PERCENTAGE2!AB78)","v":""}]
[{"$f":"eSPAR!A78","v":0},{"$f":"eSPAR!B78","v":0},{"$f":"IF(eSPAR!A78=\"\",\"\",PERCENTAGE2!W79)","v":""},{"$f":"IF(eSPAR!A78=\"\",\"\",PERCENTAGE2!X79)","v":""},{"$f":"IF(eSPAR!A78=\"\",\"\",PERCENTAGE2!Y79)","v":""},{"$f":"IF(eSPAR!A78=\"\",\"\",PERCENTAGE2!Z79)","v":""},{"$f":"IF(eSPAR!A78=\"\",\"\",PERCENTAGE2!AA79)","v":""},{"$f":"IF(eSPAR!A78=\"\",\"\",PERCENTAGE2!AB79)","v":""}]
[{"$f":"eSPAR!A79","v":0},{"$f":"eSPAR!B79","v":0},{"$f":"IF(eSPAR!A79=\"\",\"\",PERCENTAGE2!W80)","v":""},{"$f":"IF(eSPAR!A79=\"\",\"\",PERCENTAGE2!X80)","v":""},{"$f":"IF(eSPAR!A79=\"\",\"\",PERCENTAGE2!Y80)","v":""},{"$f":"IF(eSPAR!A79=\"\",\"\",PERCENTAGE2!Z80)","v":""},{"$f":"IF(eSPAR!A79=\"\",\"\",PERCENTAGE2!AA80)","v":""},{"$f":"IF(eSPAR!A79=\"\",\"\",PERCENTAGE2!AB80)","v":""}]
[{"$f":"eSPAR!A80","v":0},{"$f":"eSPAR!B80","v":0},{"$f":"IF(eSPAR!A80=\"\",\"\",PERCENTAGE2!W81)","v":""},{"$f":"IF(eSPAR!A80=\"\",\"\",PERCENTAGE2!X81)","v":""},{"$f":"IF(eSPAR!A80=\"\",\"\",PERCENTAGE2!Y81)","v":""},{"$f":"IF(eSPAR!A80=\"\",\"\",PERCENTAGE2!Z81)","v":""},{"$f":"IF(eSPAR!A80=\"\",\"\",PERCENTAGE2!AA81)","v":""},{"$f":"IF(eSPAR!A80=\"\",\"\",PERCENTAGE2!AB81)","v":""}]
[{"$f":"eSPAR!A81","v":0},{"$f":"eSPAR!B81","v":0},{"$f":"IF(eSPAR!A81=\"\",\"\",PERCENTAGE2!W82)","v":""},{"$f":"IF(eSPAR!A81=\"\",\"\",PERCENTAGE2!X82)","v":""},{"$f":"IF(eSPAR!A81=\"\",\"\",PERCENTAGE2!Y82)","v":""},{"$f":"IF(eSPAR!A81=\"\",\"\",PERCENTAGE2!Z82)","v":""},{"$f":"IF(eSPAR!A81=\"\",\"\",PERCENTAGE2!AA82)","v":""},{"$f":"IF(eSPAR!A81=\"\",\"\",PERCENTAGE2!AB82)","v":""}]
[{"$f":"eSPAR!A82","v":0},{"$f":"eSPAR!B82","v":0},{"$f":"IF(eSPAR!A82=\"\",\"\",PERCENTAGE2!W83)","v":""},{"$f":"IF(eSPAR!A82=\"\",\"\",PERCENTAGE2!X83)","v":""},{"$f":"IF(eSPAR!A82=\"\",\"\",PERCENTAGE2!Y83)","v":""},{"$f":"IF(eSPAR!A82=\"\",\"\",PERCENTAGE2!Z83)","v":""},{"$f":"IF(eSPAR!A82=\"\",\"\",PERCENTAGE2!AA83)","v":""},{"$f":"IF(eSPAR!A82=\"\",\"\",PERCENTAGE2!AB83)","v":""}]
[{"$f":"eSPAR!A83","v":0},{"$f":"eSPAR!B83","v":0},{"$f":"IF(eSPAR!A83=\"\",\"\",PERCENTAGE2!W84)","v":""},{"$f":"IF(eSPAR!A83=\"\",\"\",PERCENTAGE2!X84)","v":""},{"$f":"IF(eSPAR!A83=\"\",\"\",PERCENTAGE2!Y84)","v":""},{"$f":"IF(eSPAR!A83=\"\",\"\",PERCENTAGE2!Z84)","v":""},{"$f":"IF(eSPAR!A83=\"\",\"\",PERCENTAGE2!AA84)","v":""},{"$f":"IF(eSPAR!A83=\"\",\"\",PERCENTAGE2!AB84)","v":""}]
[{"$f":"eSPAR!A84","v":0},{"$f":"eSPAR!B84","v":0},{"$f":"IF(eSPAR!A84=\"\",\"\",PERCENTAGE2!W85)","v":""},{"$f":"IF(eSPAR!A84=\"\",\"\",PERCENTAGE2!X85)","v":""},{"$f":"IF(eSPAR!A84=\"\",\"\",PERCENTAGE2!Y85)","v":""},{"$f":"IF(eSPAR!A84=\"\",\"\",PERCENTAGE2!Z85)","v":""},{"$f":"IF(eSPAR!A84=\"\",\"\",PERCENTAGE2!AA85)","v":""},{"$f":"IF(eSPAR!A84=\"\",\"\",PERCENTAGE2!AB85)","v":""}]
[{"$f":"eSPAR!A85","v":0},{"$f":"eSPAR!B85","v":0},{"$f":"IF(eSPAR!A85=\"\",\"\",PERCENTAGE2!W86)","v":""},{"$f":"IF(eSPAR!A85=\"\",\"\",PERCENTAGE2!X86)","v":""},{"$f":"IF(eSPAR!A85=\"\",\"\",PERCENTAGE2!Y86)","v":""},{"$f":"IF(eSPAR!A85=\"\",\"\",PERCENTAGE2!Z86)","v":""},{"$f":"IF(eSPAR!A85=\"\",\"\",PERCENTAGE2!AA86)","v":""},{"$f":"IF(eSPAR!A85=\"\",\"\",PERCENTAGE2!AB86)","v":""}]

{"sheet":"pRCPT1-H","index":18,"n_rows":34,"n_cols":12,"rows_kept":34,"cut":false,"hidden":true,"merged":[[12,1,12,6],[12,8,12,10],[12,11,12,12],[0,0,0,12],[1,1,1,9],[2,1,2,9],[3,0,3,12],[5,0,5,4],[6,0,6,12],[7,0,7,12],[8,0,8,12],[10,1,10,6],[10,8,10,9],[11,1,11,6],[25,1,25,12],[13,1,13,6],[14,1,14,12],[15,1,15,5],[16,0,17,0],[16,1,17,12],[18,0,19,0],[18,1,19,12],[20,1,20,12],[21,1,21,12],[22,1,22,12],[23,1,23,12],[24,1,24,12],[26,1,26,12],[27,0,27,12],[31,2,31,3],[33,0,33,1],[33,4,33,6],[33,10,33,12]]}
[]
[]
[]
[]
[]
[]
[]
[]
[]
[]
["Student's Name",{"$f":"VLOOKUP(K11,pSPAR!A6:G85,2,FALSE)","v":"Aman Kumar"},null,null,null,null,null,null,"Roll No.",null,{"$f":"pRCPT1!K11","v":1}]
["Father's Name",{"$f":"VLOOKUP(K11,pSPAR!A6:G85,4,FALSE)","v":"Naimesh Mehta"}]
["Mother's Name",{"$f":"VLOOKUP(K11,pSPAR!A6:G85,3,FALSE)","v":"Sheetal Rani"},null,null,null,null,null,null,"Admission No.",null,null,{"$f":"VLOOKUP(K11,pSPAR!A6:G85,7,FALSE)","v":"25445"}]
["Date of Birth",{"$f":"VLOOKUP(K11,pSPAR!A6:G85,5,FALSE)","v":"11/11/2001"}]
["Address",{"$f":"VLOOKUP(K11,pSPAR!A6:G85,6,FALSE)","v":"#44, Model Town, Hisar"}]
[]
["SCHOLASTIC AREA     ","Periodic Test  1 (PT 1)"]
[]
["Subjects","MM 10"]
[]
[{"$f":"eSUBMAR!B6","v":"English"},{"$f":"VLOOKUP($K$11,'pPT1'!$A$7:$H$86,3,FALSE)","v":7}]
[{"$f":"eSUBMAR!B7","v":"Hindi"},{"$f":"VLOOKUP($K$11,'pPT1'!$A$7:$H$86,4,FALSE)","v":6}]
[{"$f":"eSUBMAR!B8","v":"Mathematics"},{"$f":"VLOOKUP($K$11,'pPT1'!$A$7:$H$86,5,FALSE)","v":7}]
[{"$f":"eSUBMAR!B9","v":"Science"},{"$f":"VLOOKUP($K$11,'pPT1'!$A$7:$H$86,6,FALSE)","v":8}]
[{"$f":"eSUBMAR!B10","v":"Social Studies"},{"$f":"VLOOKUP($K$11,'pPT1'!$A$7:$H$86,7,FALSE)","v":8}]
[{"$f":"eSUBMAR!B11","v":"I.T."},{"$f":"VLOOKUP($K$11,'pPT1'!$A$7:$H$86,8,FALSE)","v":5}]
["Total",{"$f":"SUM(B21:G26)","v":41}]
[]
[]
[]
[]
[]
[]
[{"$f":"\"Date : \"&Main!H9","v":"Date : 18/12/2017"},null,null,null,"Class Teacher",null,null,null,null,null,"Principal"]

{"sheet":"pRCPT2-H","index":19,"n_rows":34,"n_cols":12,"rows_kept":34,"cut":false,"hidden":true,"merged":[[12,1,12,6],[12,8,12,10],[12,11,12,12],[0,0,0,12],[1,1,1,9],[2,1,2,9],[3,0,3,12],[5,0,5,4],[6,0,6,12],[7,0,7,12],[8,0,8,12],[10,1,10,6],[10,8,10,9],[11,1,11,6],[25,1,25,12],[13,1,13,6],[14,1,14,12],[15,1,15,5],[16,0,17,0],[16,1,17,12],[18,0,19,0],[18,1,19,12],[20,1,20,12],[21,1,21,12],[22,1,22,12],[23,1,23,12],[24,1,24,12],[26,1,26,12],[27,0,27,12],[31,2,31,3],[33,0,33,1],[33,4,33,6],[33,10,33,12]]}
[]
[]
[]
[]
[]
[]
[]
[]
[]
[]
["Student's Name",null,null,null,null,null,null,null,"Roll No.",null,{"$f":"pRCPT2!K11","v":1}]
["Father's Name",{"$f":"VLOOKUP(K11,pSPAR!A6:G85,4,FALSE)","v":"Naimesh Mehta"}]
["Mother's Name",{"$f":"VLOOKUP(K11,pSPAR!A6:G85,3,FALSE)","v":"Sheetal Rani"},null,null,null,null,null,null,"Admission No.",null,null,{"$f":"VLOOKUP(K11,pSPAR!A6:G85,7,FALSE)","v":"25445"}]
["Date of Birth",{"$f":"VLOOKUP(K11,pSPAR!A6:G85,5,FALSE)","v":"11/11/2001"}]
["Address",{"$f":"VLOOKUP(K11,pSPAR!A6:G85,6,FALSE)","v":"#44, Model Town, Hisar"}]
[]
["SCHOLASTIC AREA     ","Periodic Test  2 (PT 2)"]
[]
["Subjects","MM 10"]
[]
[{"$f":"eSUBMAR!B6","v":"English"},{"$f":"VLOOKUP($K$11,'pPT2'!$A$7:$H$86,3,FALSE)","v":6}]
[{"$f":"eSUBMAR!B7","v":"Hindi"},{"$f":"VLOOKUP($K$11,'pPT2'!$A$7:$H$86,4,FALSE)","v":7}]
[{"$f":"eSUBMAR!B8","v":"Mathematics"},{"$f":"VLOOKUP($K$11,'pPT2'!$A$7:$H$86,5,FALSE)","v":5}]
[{"$f":"eSUBMAR!B9","v":"Science"},{"$f":"VLOOKUP($K$11,'pPT2'!$A$7:$H$86,6,FALSE)","v":6}]
[{"$f":"eSUBMAR!B10","v":"Social Studies"},{"$f":"VLOOKUP($K$11,'pPT2'!$A$7:$H$86,7,FALSE)","v":5}]
[{"$f":"eSUBMAR!B11","v":"I.T."},{"$f":"VLOOKUP($K$11,'pPT2'!$A$7:$H$86,8,FALSE)","v":6}]
["Total",{"$f":"SUM(B21:G26)","v":35}]
[]
[]
[]
[]
[]
[]
[{"$f":"\"Date : \"&Main!H9","v":"Date : 18/12/2017"},null,null,null,"Class Teacher",null,null,null,null,null,"Principal"]

{"sheet":"pRCPT3-H","index":20,"n_rows":34,"n_cols":12,"rows_kept":34,"cut":false,"hidden":true,"merged":[[12,1,12,6],[12,8,12,10],[12,11,12,12],[0,0,0,12],[1,1,1,9],[2,1,2,9],[3,0,3,12],[5,0,5,4],[6,0,6,12],[7,0,7,12],[8,0,8,12],[10,1,10,6],[10,8,10,9],[11,1,11,6],[25,1,25,12],[13,1,13,6],[14,1,14,12],[15,1,15,5],[16,0,17,0],[16,1,17,12],[18,0,19,0],[18,1,19,12],[20,1,20,12],[21,1,21,12],[22,1,22,12],[23,1,23,12],[24,1,24,12],[26,1,26,12],[27,0,27,12],[31,2,31,3],[33,0,33,1],[33,4,33,6],[33,10,33,12]]}
[]
[]
[]
[]
[]
[]
[]
[]
[]
[]
["Student's Name",{"$f":"VLOOKUP(K11,pSPAR!A6:G85,2,FALSE)","v":"Aman Kumar"},null,null,null,null,null,null,"Roll No.",null,{"$f":"pRCPT3!K11","v":1}]
["Father's Name",{"$f":"VLOOKUP(K11,pSPAR!A6:G85,4,FALSE)","v":"Naimesh Mehta"}]
["Mother's Name",{"$f":"VLOOKUP(K11,pSPAR!A6:G85,3,FALSE)","v":"Sheetal Rani"},null,null,null,null,null,null,"Admission No.",null,null,{"$f":"VLOOKUP(K11,pSPAR!A6:G85,7,FALSE)","v":"25445"}]
["Date of Birth",{"$f":"VLOOKUP(K11,pSPAR!A6:G85,5,FALSE)","v":"11/11/2001"}]
["Address",{"$f":"VLOOKUP(K11,pSPAR!A6:G85,6,FALSE)","v":"#44, Model Town, Hisar"}]
[]
["SCHOLASTIC AREA     ","Periodic Test  3 (PT 3)"]
[]
["Subjects","MM 10"]
[]
[{"$f":"eSUBMAR!B6","v":"English"},{"$f":"VLOOKUP($K$11,'pPT3'!$A$7:$H$86,3,FALSE)","v":7}]
[{"$f":"eSUBMAR!B7","v":"Hindi"},{"$f":"VLOOKUP($K$11,'pPT3'!$A$7:$H$86,4,FALSE)","v":8}]
[{"$f":"eSUBMAR!B8","v":"Mathematics"},{"$f":"VLOOKUP($K$11,'pPT3'!$A$7:$H$86,5,FALSE)","v":9}]
[{"$f":"eSUBMAR!B9","v":"Science"},{"$f":"VLOOKUP($K$11,'pPT3'!$A$7:$H$86,6,FALSE)","v":6}]
[{"$f":"eSUBMAR!B10","v":"Social Studies"},{"$f":"VLOOKUP($K$11,'pPT3'!$A$7:$H$86,7,FALSE)","v":7}]
[{"$f":"eSUBMAR!B11","v":"I.T."},{"$f":"VLOOKUP($K$11,'pPT3'!$A$7:$H$86,8,FALSE)","v":8}]
["Total",{"$f":"SUM(B21:G26)","v":45}]
[]
[]
[]
[]
[]
[]
[{"$f":"\"Date : \"&Main!H9","v":"Date : 18/12/2017"},null,null,null,"Class Teacher",null,null,null,null,null,"Principal"]

{"sheet":"Buy","index":21,"n_rows":8,"n_cols":3,"rows_kept":8,"cut":false,"hidden":false,"merged":[[4,2,5,9],[6,2,6,9],[2,0,2,7],[7,1,7,10]]}
[]
[]
[]
[]
[null,null,"This page is not available in Trail Version of eParinaam!"]
[]
[null,null,"Buy Our CBSE Report Card Generator here-"]
[null,"http://www.parashosting.com/cbse-report-card-software-2017-onwards.html"]